{"text_format":"1","workbook":"xlsx","n_sheets":40,"sheets":["A1","A2","B1","B2","M1","N1","N2","C1","C2","C3","D1","D2","D3","E1","E2","E3","F1","F2","G1","G2","H1","J1","J2","J3","K1","K2","L1","L2","EST","CENTRE","NORD","SUD","OUEST","RESULTATS","RECENS 1T","REPART VdB 1T","REPART CAB 1T","ELUS 1T","Candidats","GRAPHE"],"not_rendered":{"charts":1,"images":33,"macros":1,"external_links":0,"defined_names":1,"comments":0,"pivot_tables":0},"unopened":[],"bounds":{"document_bytes":16777216,"sheet_cells":100000,"rows_first":2000,"rows_last":500,"rows_between":2000,"halvings":0,"cell_chars":16384,"cell_head_chars":4096},"cells_cut":0,"cells_raw":0,"read":"whole","date_system":"1900"}

{"sheet":"A1","index":0,"n_rows":25,"n_cols":7,"rows_kept":25,"cut":false,"hidden":false,"merged":[]}
[]
[]
["A1","-","HÔTEL DE VILLE (Place d'Armes)"]
[]
[]
[]
[null,null,null,"INSCRITS",949,"%"]
[null,null,null,"Émargements",508]
[null,null,null,"Votants (participation)",508,{"$f":"IF(E7=0,0,E9/E7)","v":0.53530031612223394},"(1)"]
[null,null,null,"Nuls",12,{"$f":"IF(E9=0,0,E10/E9)","v":2.3622047244094488E-2},"(2)"]
[null,null,null,"Exprimés",496,{"$f":"IF(E7=0,0,E11/E7)","v":0.52265542676501575},"(3)"]
[null,null,null,{"$f":"Candidats!$A2&\" \"&Candidats!$B2","v":"Bertrand CHEVALIER"},20,{"$f":"IF(E$11=0,0,E12/E$11)","v":4.0322580645161289E-2},"(4)"]
[null,null,null,{"$f":"Candidats!$A3&\" \"&Candidats!$B3","v":"Marc ARCHAMBAULT"},32,6.4516129032258063E-2]
[null,null,null,{"$f":"Candidats!$A4&\" \"&Candidats!$B4","v":"Étienne BUTZBACH"},104,0.20967741935483872]
[null,null,null,{"$f":"Candidats!$A5&\" \"&Candidats!$B5","v":"Bastien FAUDOT"},60,0.12096774193548387]
[null,null,null,{"$f":"Candidats!$A6&\" \"&Candidats!$B6","v":"Christophe GRUDLER"},105,0.21169354838709678]
[null,null,null,{"$f":"Candidats!$A7&\" \"&Candidats!$B7","v":"Jean-Marie PHEULPIN"},8,1.6129032258064516E-2]
[null,null,null,{"$f":"Candidats!$A8&\" \"&Candidats!$B8","v":"Damien MESLOT"},167,0.33669354838709675]
[null,null,null,null,{"$f":"IF(SUM(E12:E18)<>E11,\"!!! FAUX\",\"\")","v":""}]
[null,null,null,"TOTAL  :",{"$f":"SUM(E12:E18)","v":496}]
[]
[null,null,null,null,null,"(1) Votants / Inscrits"]
[null,null,null,null,null,"(2) Nuls / Votants"]
[null,null,null,null,null,"(3) Exprimés / Inscrits"]
[null,null,null,null,null,"(4) Score / Exprimés"]

{"sheet":"A2","index":1,"n_rows":25,"n_cols":7,"rows_kept":25,"cut":false,"hidden":false,"merged":[]}
[]
[]
["A2","-","SALLE DES FÊTES (Place de la République)"]
[]
[]
[]
[null,null,null,"INSCRITS",956,"%"]
[null,null,null,"Émargements",610]
[null,null,null,"Votants (participation)",610,{"$f":"IF(E7=0,0,E9/E7)","v":0.63807531380753135},"(1)"]
[null,null,null,"Nuls",18,{"$f":"IF(E9=0,0,E10/E9)","v":2.9508196721311476E-2},"(2)"]
[null,null,null,"Exprimés",592,{"$f":"IF(E7=0,0,E11/E7)","v":0.61924686192468614},"(3)"]
[null,null,null,{"$f":"Candidats!$A2&\" \"&Candidats!$B2","v":"Bertrand CHEVALIER"},29,{"$f":"IF(E$11=0,0,E12/E$11)","v":4.8986486486486486E-2},"(4)"]
[null,null,null,{"$f":"Candidats!$A3&\" \"&Candidats!$B3","v":"Marc ARCHAMBAULT"},42,7.0945945945945943E-2]
[null,null,null,{"$f":"Candidats!$A4&\" \"&Candidats!$B4","v":"Étienne BUTZBACH"},107,0.18074324324324326]
[null,null,null,{"$f":"Candidats!$A5&\" \"&Candidats!$B5","v":"Bastien FAUDOT"},69,0.11655405405405406]
[null,null,null,{"$f":"Candidats!$A6&\" \"&Candidats!$B6","v":"Christophe GRUDLER"},105,0.17736486486486486]
[null,null,null,{"$f":"Candidats!$A7&\" \"&Candidats!$B7","v":"Jean-Marie PHEULPIN"},7,1.1824324324324325E-2]
[null,null,null,{"$f":"Candidats!$A8&\" \"&Candidats!$B8","v":"Damien MESLOT"},233,0.39358108108108109]
[null,null,null,null,{"$f":"IF(SUM(E12:E18)<>E11,\"!!! FAUX\",\"\")","v":""}]
[null,null,null,"TOTAL  :",{"$f":"SUM(E12:E18)","v":592}]
[]
[null,null,null,null,null,"(1) Votants / Inscrits"]
[null,null,null,null,null,"(2) Nuls / Votants"]
[null,null,null,null,null,"(3) Exprimés / Inscrits"]
[null,null,null,null,null,"(4) Score / Exprimés"]

{"sheet":"B1","index":2,"n_rows":25,"n_cols":7,"rows_kept":25,"cut":false,"hidden":false,"merged":[]}
[]
[]
["B1","-","GROUPE SCOLAIRE VICTOR HUGO (Faubourg de Montbéliard)"]
[]
[]
[]
[null,null,null,"INSCRITS",1096,"%"]
[null,null,null,"Émargements",623]
[null,null,null,"Votants (participation)",622,{"$f":"IF(E7=0,0,E9/E7)","v":0.56751824817518248},"(1)"]
[null,null,null,"Nuls",11,{"$f":"IF(E9=0,0,E10/E9)","v":1.7684887459807074E-2},"(2)"]
[null,null,null,"Exprimés",611,{"$f":"IF(E7=0,0,E11/E7)","v":0.55748175182481752},"(3)"]
[null,null,null,{"$f":"Candidats!$A2&\" \"&Candidats!$B2","v":"Bertrand CHEVALIER"},26,{"$f":"IF(E$11=0,0,E12/E$11)","v":4.2553191489361701E-2},"(4)"]
[null,null,null,{"$f":"Candidats!$A3&\" \"&Candidats!$B3","v":"Marc ARCHAMBAULT"},46,7.5286415711947621E-2]
[null,null,null,{"$f":"Candidats!$A4&\" \"&Candidats!$B4","v":"Étienne BUTZBACH"},132,0.2160392798690671]
[null,null,null,{"$f":"Candidats!$A5&\" \"&Candidats!$B5","v":"Bastien FAUDOT"},71,0.11620294599018004]
[null,null,null,{"$f":"Candidats!$A6&\" \"&Candidats!$B6","v":"Christophe GRUDLER"},115,0.18821603927986907]
[null,null,null,{"$f":"Candidats!$A7&\" \"&Candidats!$B7","v":"Jean-Marie PHEULPIN"},9,1.4729950900163666E-2]
[null,null,null,{"$f":"Candidats!$A8&\" \"&Candidats!$B8","v":"Damien MESLOT"},212,0.34697217675941078]
[null,null,null,null,{"$f":"IF(SUM(E12:E18)<>E11,\"!!! FAUX\",\"\")","v":""}]
[null,null,null,"TOTAL  :",{"$f":"SUM(E12:E18)","v":611}]
[]
[null,null,null,null,null,"(1) Votants / Inscrits"]
[null,null,null,null,null,"(2) Nuls / Votants"]
[null,null,null,null,null,"(3) Exprimés / Inscrits"]
[null,null,null,null,null,"(4) Score / Exprimés"]

{"sheet":"B2","index":3,"n_rows":25,"n_cols":7,"rows_kept":25,"cut":false,"hidden":false,"merged":[]}
[]
[]
["B2","-","GROUPE SCOLAIRE VICTOR HUGO (Faubourg de Montbéliard)"]
[]
[]
[]
[null,null,null,"INSCRITS",1167,"%"]
[null,null,null,"Émargements",715]
[null,null,null,"Votants (participation)",715,{"$f":"IF(E7=0,0,E9/E7)","v":0.61268209083119107},"(1)"]
[null,null,null,"Nuls",15,{"$f":"IF(E9=0,0,E10/E9)","v":2.097902097902098E-2},"(2)"]
[null,null,null,"Exprimés",700,{"$f":"IF(E7=0,0,E11/E7)","v":0.59982862039417306},"(3)"]
[null,null,null,{"$f":"Candidats!$A2&\" \"&Candidats!$B2","v":"Bertrand CHEVALIER"},37,{"$f":"IF(E$11=0,0,E12/E$11)","v":5.2857142857142859E-2},"(4)"]
[null,null,null,{"$f":"Candidats!$A3&\" \"&Candidats!$B3","v":"Marc ARCHAMBAULT"},57,8.1428571428571433E-2]
[null,null,null,{"$f":"Candidats!$A4&\" \"&Candidats!$B4","v":"Étienne BUTZBACH"},126,0.18]
[null,null,null,{"$f":"Candidats!$A5&\" \"&Candidats!$B5","v":"Bastien FAUDOT"},87,0.12428571428571429]
[null,null,null,{"$f":"Candidats!$A6&\" \"&Candidats!$B6","v":"Christophe GRUDLER"},126,0.18]
[null,null,null,{"$f":"Candidats!$A7&\" \"&Candidats!$B7","v":"Jean-Marie PHEULPIN"},12,1.7142857142857144E-2]
[null,null,null,{"$f":"Candidats!$A8&\" \"&Candidats!$B8","v":"Damien MESLOT"},255,0.36428571428571427]
[null,null,null,null,{"$f":"IF(SUM(E12:E18)<>E11,\"!!! FAUX\",\"\")","v":""}]
[null,null,null,"TOTAL  :",{"$f":"SUM(E12:E18)","v":700}]
[]
[null,null,null,null,null,"(1) Votants / Inscrits"]
[null,null,null,null,null,"(2) Nuls / Votants"]
[null,null,null,null,null,"(3) Exprimés / Inscrits"]
[null,null,null,null,null,"(4) Score / Exprimés"]

{"sheet":"M1","index":4,"n_rows":25,"n_cols":7,"rows_kept":25,"cut":false,"hidden":false,"merged":[]}
[]
[]
["M1","-","ÉCOLE MATERNELLE SAINT-EXUPÉRY (Rue de la Paix)"]
[]
[]
[]
[null,null,null,"INSCRITS",1306,"%"]
[null,null,null,"Émargements",599]
[null,null,null,"Votants (participation)",599,{"$f":"IF(E7=0,0,E9/E7)","v":0.45865237366003064},"(1)"]
[null,null,null,"Nuls",18,{"$f":"IF(E9=0,0,E10/E9)","v":3.0050083472454091E-2},"(2)"]
[null,null,null,"Exprimés",581,{"$f":"IF(E7=0,0,E11/E7)","v":0.44486983154670751},"(3)"]
[null,null,null,{"$f":"Candidats!$A2&\" \"&Candidats!$B2","v":"Bertrand CHEVALIER"},23,{"$f":"IF(E$11=0,0,E12/E$11)","v":3.9586919104991396E-2},"(4)"]
[null,null,null,{"$f":"Candidats!$A3&\" \"&Candidats!$B3","v":"Marc ARCHAMBAULT"},50,8.6058519793459548E-2]
[null,null,null,{"$f":"Candidats!$A4&\" \"&Candidats!$B4","v":"Étienne BUTZBACH"},215,0.37005163511187605]
[null,null,null,{"$f":"Candidats!$A5&\" \"&Candidats!$B5","v":"Bastien FAUDOT"},50,8.6058519793459548E-2]
[null,null,null,{"$f":"Candidats!$A6&\" \"&Candidats!$B6","v":"Christophe GRUDLER"},112,0.19277108433734941]
[null,null,null,{"$f":"Candidats!$A7&\" \"&Candidats!$B7","v":"Jean-Marie PHEULPIN"},8,1.3769363166953529E-2]
[null,null,null,{"$f":"Candidats!$A8&\" \"&Candidats!$B8","v":"Damien MESLOT"},123,0.2117039586919105]
[null,null,null,null,{"$f":"IF(SUM(E12:E18)<>E11,\"!!! FAUX\",\"\")","v":""}]
[null,null,null,"TOTAL  :",{"$f":"SUM(E12:E18)","v":581}]
[]
[null,null,null,null,null,"(1) Votants / Inscrits"]
[null,null,null,null,null,"(2) Nuls / Votants"]
[null,null,null,null,null,"(3) Exprimés / Inscrits"]
[null,null,null,null,null,"(4) Score / Exprimés"]

{"sheet":"N1","index":5,"n_rows":25,"n_cols":7,"rows_kept":25,"cut":false,"hidden":false,"merged":[]}
[]
[]
["N1","-","ÉCOLE JEAN MOULIN (Rue Steiner)"]
[]
[]
[]
[null,null,null,"INSCRITS",1456,"%"]
[null,null,null,"Émargements",825]
[null,null,null,"Votants (participation)",825,{"$f":"IF(E7=0,0,E9/E7)","v":0.56662087912087911},"(1)"]
[null,null,null,"Nuls",17,{"$f":"IF(E9=0,0,E10/E9)","v":2.0606060606060607E-2},"(2)"]
[null,null,null,"Exprimés",808,{"$f":"IF(E7=0,0,E11/E7)","v":0.55494505494505497},"(3)"]
[null,null,null,{"$f":"Candidats!$A2&\" \"&Candidats!$B2","v":"Bertrand CHEVALIER"},32,{"$f":"IF(E$11=0,0,E12/E$11)","v":3.9603960396039604E-2},"(4)"]
[null,null,null,{"$f":"Candidats!$A3&\" \"&Candidats!$B3","v":"Marc ARCHAMBAULT"},111,0.13737623762376239]
[null,null,null,{"$f":"Candidats!$A4&\" \"&Candidats!$B4","v":"Étienne BUTZBACH"},150,0.18564356435643564]
[null,null,null,{"$f":"Candidats!$A5&\" \"&Candidats!$B5","v":"Bastien FAUDOT"},78,9.6534653465346537E-2]
[null,null,null,{"$f":"Candidats!$A6&\" \"&Candidats!$B6","v":"Christophe GRUDLER"},176,0.21782178217821782]
[null,null,null,{"$f":"Candidats!$A7&\" \"&Candidats!$B7","v":"Jean-Marie PHEULPIN"},12,1.4851485148514851E-2]
[null,null,null,{"$f":"Candidats!$A8&\" \"&Candidats!$B8","v":"Damien MESLOT"},249,0.30816831683168316]
[null,null,null,null,{"$f":"IF(SUM(E12:E18)<>E11,\"!!! FAUX\",\"\")","v":""}]
[null,null,null,"TOTAL  :",{"$f":"SUM(E12:E18)","v":808}]
[]
[null,null,null,null,null,"(1) Votants / Inscrits"]
[null,null,null,null,null,"(2) Nuls / Votants"]
[null,null,null,null,null,"(3) Exprimés / Inscrits"]
[null,null,null,null,null,"(4) Score / Exprimés"]

{"sheet":"N2","index":6,"n_rows":25,"n_cols":7,"rows_kept":25,"cut":false,"hidden":false,"merged":[]}
[]
[]
["N2","-","CITÉ DES ASSOCIATIONS (Rue Jean Pierre Melville)"]
[]
[]
[]
[null,null,null,"INSCRITS",905,"%"]
[null,null,null,"Émargements",577]
[null,null,null,"Votants (participation)",577,{"$f":"IF(E7=0,0,E9/E7)","v":0.63756906077348063},"(1)"]
[null,null,null,"Nuls",11,{"$f":"IF(E9=0,0,E10/E9)","v":1.9064124783362217E-2},"(2)"]
[null,null,null,"Exprimés",566,{"$f":"IF(E7=0,0,E11/E7)","v":0.62541436464088396},"(3)"]
[null,null,null,{"$f":"Candidats!$A2&\" \"&Candidats!$B2","v":"Bertrand CHEVALIER"},25,{"$f":"IF(E$11=0,0,E12/E$11)","v":4.4169611307420496E-2},"(4)"]
[null,null,null,{"$f":"Candidats!$A3&\" \"&Candidats!$B3","v":"Marc ARCHAMBAULT"},44,7.7738515901060068E-2]
[null,null,null,{"$f":"Candidats!$A4&\" \"&Candidats!$B4","v":"Étienne BUTZBACH"},113,0.19964664310954064]
[null,null,null,{"$f":"Candidats!$A5&\" \"&Candidats!$B5","v":"Bastien FAUDOT"},67,0.11837455830388692]
[null,null,null,{"$f":"Candidats!$A6&\" \"&Candidats!$B6","v":"Christophe GRUDLER"},167,0.29505300353356889]
[null,null,null,{"$f":"Candidats!$A7&\" \"&Candidats!$B7","v":"Jean-Marie PHEULPIN"},5,8.8339222614840993E-3]
[null,null,null,{"$f":"Candidats!$A8&\" \"&Candidats!$B8","v":"Damien MESLOT"},145,0.25618374558303886]
[null,null,null,null,{"$f":"IF(SUM(E12:E18)<>E11,\"!!! FAUX\",\"\")","v":""}]
[null,null,null,"TOTAL  :",{"$f":"SUM(E12:E18)","v":566}]
[]
[null,null,null,null,null,"(1) Votants / Inscrits"]
[null,null,null,null,null,"(2) Nuls / Votants"]
[null,null,null,null,null,"(3) Exprimés / Inscrits"]
[null,null,null,null,null,"(4) Score / Exprimés"]

{"sheet":"C1","index":7,"n_rows":25,"n_cols":7,"rows_kept":25,"cut":false,"hidden":false,"merged":[]}
[]
[]
["C1","-","ÉCOLE VICTOR SCHOELCHER (Rue Gaston Deferre)"]
[]
[]
[]
[null,null,null,"INSCRITS",1210,"%"]
[null,null,null,"Émargements",719]
[null,null,null,"Votants (participation)",719,{"$f":"IF(E7=0,0,E9/E7)","v":0.59421487603305789},"(1)"]
[null,null,null,"Nuls",17,{"$f":"IF(E9=0,0,E10/E9)","v":2.3643949930458971E-2},"(2)"]
[null,null,null,"Exprimés",702,{"$f":"IF(E7=0,0,E11/E7)","v":0.58016528925619837},"(3)"]
[null,null,null,{"$f":"Candidats!$A2&\" \"&Candidats!$B2","v":"Bertrand CHEVALIER"},24,{"$f":"IF(E$11=0,0,E12/E$11)","v":3.4188034188034191E-2},"(4)"]
[null,null,null,{"$f":"Candidats!$A3&\" \"&Candidats!$B3","v":"Marc ARCHAMBAULT"},65,9.2592592592592587E-2]
[null,null,null,{"$f":"Candidats!$A4&\" \"&Candidats!$B4","v":"Étienne BUTZBACH"},153,0.21794871794871795]
[null,null,null,{"$f":"Candidats!$A5&\" \"&Candidats!$B5","v":"Bastien FAUDOT"},89,0.12678062678062679]
[null,null,null,{"$f":"Candidats!$A6&\" \"&Candidats!$B6","v":"Christophe GRUDLER"},92,0.13105413105413105]
[null,null,null,{"$f":"Candidats!$A7&\" \"&Candidats!$B7","v":"Jean-Marie PHEULPIN"},9,1.282051282051282E-2]
[null,null,null,{"$f":"Candidats!$A8&\" \"&Candidats!$B8","v":"Damien MESLOT"},270,0.38461538461538464]
[null,null,null,null,{"$f":"IF(SUM(E12:E18)<>E11,\"!!! FAUX\",\"\")","v":""}]
[null,null,null,"TOTAL  :",{"$f":"SUM(E12:E18)","v":702}]
[]
[null,null,null,null,null,"(1) Votants / Inscrits"]
[null,null,null,null,null,"(2) Nuls / Votants"]
[null,null,null,null,null,"(3) Exprimés / Inscrits"]
[null,null,null,null,null,"(4) Score / Exprimés"]

{"sheet":"C2","index":8,"n_rows":25,"n_cols":7,"rows_kept":25,"cut":false,"hidden":false,"merged":[]}
[]
[]
["C2","-","MAISON DU PEUPLE (Place de la Résistance)"]
[]
[]
[]
[null,null,null,"INSCRITS",763,"%"]
[null,null,null,"Émargements",474]
[null,null,null,"Votants (participation)",474,{"$f":"IF(E7=0,0,E9/E7)","v":0.62123197903014415},"(1)"]
[null,null,null,"Nuls",11,{"$f":"IF(E9=0,0,E10/E9)","v":2.3206751054852322E-2},"(2)"]
[null,null,null,"Exprimés",463,{"$f":"IF(E7=0,0,E11/E7)","v":0.60681520314547832},"(3)"]
[null,null,null,{"$f":"Candidats!$A2&\" \"&Candidats!$B2","v":"Bertrand CHEVALIER"},23,{"$f":"IF(E$11=0,0,E12/E$11)","v":4.9676025917926567E-2},"(4)"]
[null,null,null,{"$f":"Candidats!$A3&\" \"&Candidats!$B3","v":"Marc ARCHAMBAULT"},43,9.2872570194384454E-2]
[null,null,null,{"$f":"Candidats!$A4&\" \"&Candidats!$B4","v":"Étienne BUTZBACH"},82,0.17710583153347731]
[null,null,null,{"$f":"Candidats!$A5&\" \"&Candidats!$B5","v":"Bastien FAUDOT"},54,0.11663066954643629]
[null,null,null,{"$f":"Candidats!$A6&\" \"&Candidats!$B6","v":"Christophe GRUDLER"},58,0.12526997840172785]
[null,null,null,{"$f":"Candidats!$A7&\" \"&Candidats!$B7","v":"Jean-Marie PHEULPIN"},5,1.079913606911447E-2]
[null,null,null,{"$f":"Candidats!$A8&\" \"&Candidats!$B8","v":"Damien MESLOT"},198,0.42764578833693306]
[null,null,null,null,{"$f":"IF(SUM(E12:E18)<>E11,\"!!! FAUX\",\"\")","v":""}]
[null,null,null,"TOTAL  :",{"$f":"SUM(E12:E18)","v":463}]
[]
[null,null,null,null,null,"(1) Votants / Inscrits"]
[null,null,null,null,null,"(2) Nuls / Votants"]
[null,null,null,null,null,"(3) Exprimés / Inscrits"]
[null,null,null,null,null,"(4) Score / Exprimés"]

{"sheet":"C3","index":9,"n_rows":25,"n_cols":7,"rows_kept":25,"cut":false,"hidden":false,"merged":[]}
[]
[]
["C3","-","MAISON DU PEUPLE (Place de la Résistance)"]
[]
[]
[]
[null,null,null,"INSCRITS",921,"%"]
[null,null,null,"Émargements",564]
[null,null,null,"Votants (participation)",564,{"$f":"IF(E7=0,0,E9/E7)","v":0.6123778501628665},"(1)"]
[null,null,null,"Nuls",12,{"$f":"IF(E9=0,0,E10/E9)","v":2.1276595744680851E-2},"(2)"]
[null,null,null,"Exprimés",552,{"$f":"IF(E7=0,0,E11/E7)","v":0.59934853420195444},"(3)"]
[null,null,null,{"$f":"Candidats!$A2&\" \"&Candidats!$B2","v":"Bertrand CHEVALIER"},19,{"$f":"IF(E$11=0,0,E12/E$11)","v":3.4420289855072464E-2},"(4)"]
[null,null,null,{"$f":"Candidats!$A3&\" \"&Candidats!$B3","v":"Marc ARCHAMBAULT"},48,8.6956521739130432E-2]
[null,null,null,{"$f":"Candidats!$A4&\" \"&Candidats!$B4","v":"Étienne BUTZBACH"},105,0.19021739130434784]
[null,null,null,{"$f":"Candidats!$A5&\" \"&Candidats!$B5","v":"Bastien FAUDOT"},56,0.10144927536231885]
[null,null,null,{"$f":"Candidats!$A6&\" \"&Candidats!$B6","v":"Christophe GRUDLER"},62,0.11231884057971014]
[null,null,null,{"$f":"Candidats!$A7&\" \"&Candidats!$B7","v":"Jean-Marie PHEULPIN"},6,1.0869565217391304E-2]
[null,null,null,{"$f":"Candidats!$A8&\" \"&Candidats!$B8","v":"Damien MESLOT"},256,0.46376811594202899]
[null,null,null,null,{"$f":"IF(SUM(E12:E18)<>E11,\"!!! FAUX\",\"\")","v":""}]
[null,null,null,"TOTAL  :",{"$f":"SUM(E12:E18)","v":552}]
[]
[null,null,null,null,null,"(1) Votants / Inscrits"]
[null,null,null,null,null,"(2) Nuls / Votants"]
[null,null,null,null,null,"(3) Exprimés / Inscrits"]
[null,null,null,null,null,"(4) Score / Exprimés"]

{"sheet":"D1","index":10,"n_rows":25,"n_cols":7,"rows_kept":25,"cut":false,"hidden":false,"merged":[]}
[]
[]
["D1","-","GROUPE SCOLAIRE CHÂTEAUDUN (Rue de Châteaudun)"]
[]
[]
[]
[null,null,null,"INSCRITS",1074,"%"]
[null,null,null,"Émargements",613]
[null,null,null,"Votants (participation)",613,{"$f":"IF(E7=0,0,E9/E7)","v":0.57076350093109873},"(1)"]
[null,null,null,"Nuls",17,{"$f":"IF(E9=0,0,E10/E9)","v":2.7732463295269169E-2},"(2)"]
[null,null,null,"Exprimés",596,{"$f":"IF(E7=0,0,E11/E7)","v":0.55493482309124764},"(3)"]
[null,null,null,{"$f":"Candidats!$A2&\" \"&Candidats!$B2","v":"Bertrand CHEVALIER"},14,{"$f":"IF(E$11=0,0,E12/E$11)","v":2.3489932885906041E-2},"(4)"]
[null,null,null,{"$f":"Candidats!$A3&\" \"&Candidats!$B3","v":"Marc ARCHAMBAULT"},70,0.1174496644295302]
[null,null,null,{"$f":"Candidats!$A4&\" \"&Candidats!$B4","v":"Étienne BUTZBACH"},103,0.17281879194630873]
[null,null,null,{"$f":"Candidats!$A5&\" \"&Candidats!$B5","v":"Bastien FAUDOT"},51,8.557046979865772E-2]
[null,null,null,{"$f":"Candidats!$A6&\" \"&Candidats!$B6","v":"Christophe GRUDLER"},80,0.13422818791946309]
[null,null,null,{"$f":"Candidats!$A7&\" \"&Candidats!$B7","v":"Jean-Marie PHEULPIN"},7,1.1744966442953021E-2]
[null,null,null,{"$f":"Candidats!$A8&\" \"&Candidats!$B8","v":"Damien MESLOT"},271,0.45469798657718119]
[null,null,null,null,{"$f":"IF(SUM(E12:E18)<>E11,\"!!! FAUX\",\"\")","v":""}]
[null,null,null,"TOTAL  :",{"$f":"SUM(E12:E18)","v":596}]
[]
[null,null,null,null,null,"(1) Votants / Inscrits"]
[null,null,null,null,null,"(2) Nuls / Votants"]
[null,null,null,null,null,"(3) Exprimés / Inscrits"]
[null,null,null,null,null,"(4) Score / Exprimés"]

{"sheet":"D2","index":11,"n_rows":25,"n_cols":7,"rows_kept":25,"cut":false,"hidden":false,"merged":[]}
[]
[]
["D2","-","GROUPE SCOLAIRE CHÂTEAUDUN (Rue de Châteaudun)"]
[]
[]
[]
[null,null,null,"INSCRITS",838,"%"]
[null,null,null,"Émargements",503]
[null,null,null,"Votants (participation)",503,{"$f":"IF(E7=0,0,E9/E7)","v":0.60023866348448685},"(1)"]
[null,null,null,"Nuls",22,{"$f":"IF(E9=0,0,E10/E9)","v":4.37375745526839E-2},"(2)"]
[null,null,null,"Exprimés",481,{"$f":"IF(E7=0,0,E11/E7)","v":0.57398568019093077},"(3)"]
[null,null,null,{"$f":"Candidats!$A2&\" \"&Candidats!$B2","v":"Bertrand CHEVALIER"},20,{"$f":"IF(E$11=0,0,E12/E$11)","v":4.1580041580041582E-2},"(4)"]
[null,null,null,{"$f":"Candidats!$A3&\" \"&Candidats!$B3","v":"Marc ARCHAMBAULT"},56,0.11642411642411643]
[null,null,null,{"$f":"Candidats!$A4&\" \"&Candidats!$B4","v":"Étienne BUTZBACH"},67,0.1392931392931393]
[null,null,null,{"$f":"Candidats!$A5&\" \"&Candidats!$B5","v":"Bastien FAUDOT"},56,0.11642411642411643]
[null,null,null,{"$f":"Candidats!$A6&\" \"&Candidats!$B6","v":"Christophe GRUDLER"},78,0.16216216216216217]
[null,null,null,{"$f":"Candidats!$A7&\" \"&Candidats!$B7","v":"Jean-Marie PHEULPIN"},7,1.4553014553014554E-2]
[null,null,null,{"$f":"Candidats!$A8&\" \"&Candidats!$B8","v":"Damien MESLOT"},197,0.40956340956340959]
[null,null,null,null,{"$f":"IF(SUM(E12:E18)<>E11,\"!!! FAUX\",\"\")","v":""}]
[null,null,null,"TOTAL  :",{"$f":"SUM(E12:E18)","v":481}]
[]
[null,null,null,null,null,"(1) Votants / Inscrits"]
[null,null,null,null,null,"(2) Nuls / Votants"]
[null,null,null,null,null,"(3) Exprimés / Inscrits"]
[null,null,null,null,null,"(4) Score / Exprimés"]

{"sheet":"D3","index":12,"n_rows":25,"n_cols":7,"rows_kept":25,"cut":false,"hidden":false,"merged":[]}
[]
[]
["D3","-","GROUPE SCOLAIRE CHÂTEAUDUN (Rue de Châteaudun)"]
[]
[]
[]
[null,null,null,"INSCRITS",912,"%"]
[null,null,null,"Émargements",554]
[null,null,null,"Votants (participation)",554,{"$f":"IF(E7=0,0,E9/E7)","v":0.60745614035087714},"(1)"]
[null,null,null,"Nuls",18,{"$f":"IF(E9=0,0,E10/E9)","v":3.2490974729241874E-2},"(2)"]
[null,null,null,"Exprimés",536,{"$f":"IF(E7=0,0,E11/E7)","v":0.58771929824561409},"(3)"]
[null,null,null,{"$f":"Candidats!$A2&\" \"&Candidats!$B2","v":"Bertrand CHEVALIER"},37,{"$f":"IF(E$11=0,0,E12/E$11)","v":6.9029850746268662E-2},"(4)"]
[null,null,null,{"$f":"Candidats!$A3&\" \"&Candidats!$B3","v":"Marc ARCHAMBAULT"},91,0.16977611940298507]
[null,null,null,{"$f":"Candidats!$A4&\" \"&Candidats!$B4","v":"Étienne BUTZBACH"},70,0.13059701492537312]
[null,null,null,{"$f":"Candidats!$A5&\" \"&Candidats!$B5","v":"Bastien FAUDOT"},47,8.7686567164179108E-2]
[null,null,null,{"$f":"Candidats!$A6&\" \"&Candidats!$B6","v":"Christophe GRUDLER"},76,0.1417910447761194]
[null,null,null,{"$f":"Candidats!$A7&\" \"&Candidats!$B7","v":"Jean-Marie PHEULPIN"},16,2.9850746268656716E-2]
[null,null,null,{"$f":"Candidats!$A8&\" \"&Candidats!$B8","v":"Damien MESLOT"},199,0.3712686567164179]
[null,null,null,null,{"$f":"IF(SUM(E12:E18)<>E11,\"!!! FAUX\",\"\")","v":""}]
[null,null,null,"TOTAL  :",{"$f":"SUM(E12:E18)","v":536}]
[]
[null,null,null,null,null,"(1) Votants / Inscrits"]
[null,null,null,null,null,"(2) Nuls / Votants"]
[null,null,null,null,null,"(3) Exprimés / Inscrits"]
[null,null,null,null,null,"(4) Score / Exprimés"]

{"sheet":"E1","index":13,"n_rows":25,"n_cols":7,"rows_kept":25,"cut":false,"hidden":false,"merged":[]}
[]
[]
["E1","-","GROUPE SCOLAIRE RAYMOND AUBERT (Rue de la 1ère Armée Française)"]
[]
[]
[]
[null,null,null,"INSCRITS",1181,"%"]
[null,null,null,"Émargements",668]
[null,null,null,"Votants (participation)",668,{"$f":"IF(E7=0,0,E9/E7)","v":0.56562235393734128},"(1)"]
[null,null,null,"Nuls",19,{"$f":"IF(E9=0,0,E10/E9)","v":2.8443113772455089E-2},"(2)"]
[null,null,null,"Exprimés",649,{"$f":"IF(E7=0,0,E11/E7)","v":0.54953429297205758},"(3)"]
[null,null,null,{"$f":"Candidats!$A2&\" \"&Candidats!$B2","v":"Bertrand CHEVALIER"},23,{"$f":"IF(E$11=0,0,E12/E$11)","v":3.543913713405239E-2},"(4)"]
[null,null,null,{"$f":"Candidats!$A3&\" \"&Candidats!$B3","v":"Marc ARCHAMBAULT"},96,0.14791987673343607]
[null,null,null,{"$f":"Candidats!$A4&\" \"&Candidats!$B4","v":"Étienne BUTZBACH"},88,0.13559322033898305]
[null,null,null,{"$f":"Candidats!$A5&\" \"&Candidats!$B5","v":"Bastien FAUDOT"},88,0.13559322033898305]
[null,null,null,{"$f":"Candidats!$A6&\" \"&Candidats!$B6","v":"Christophe GRUDLER"},92,0.14175654853620956]
[null,null,null,{"$f":"Candidats!$A7&\" \"&Candidats!$B7","v":"Jean-Marie PHEULPIN"},18,2.7734976887519261E-2]
[null,null,null,{"$f":"Candidats!$A8&\" \"&Candidats!$B8","v":"Damien MESLOT"},244,0.37596302003081666]
[null,null,null,null,{"$f":"IF(SUM(E12:E18)<>E11,\"!!! FAUX\",\"\")","v":""}]
[null,null,null,"TOTAL  :",{"$f":"SUM(E12:E18)","v":649}]
[]
[null,null,null,null,null,"(1) Votants / Inscrits"]
[null,null,null,null,null,"(2) Nuls / Votants"]
[null,null,null,null,null,"(3) Exprimés / Inscrits"]
[null,null,null,null,null,"(4) Score / Exprimés"]

{"sheet":"E2","index":14,"n_rows":25,"n_cols":7,"rows_kept":25,"cut":false,"hidden":false,"merged":[]}
[]
[]
["E2","-","GROUPE SCOLAIRE RAYMOND AUBERT (Rue de la 1ère Armée Française)"]
[]
[]
[]
[null,null,null,"INSCRITS",1212,"%"]
[null,null,null,"Émargements",680]
[null,null,null,"Votants (participation)",681,{"$f":"IF(E7=0,0,E9/E7)","v":0.56188118811881194},"(1)"]
[null,null,null,"Nuls",28,{"$f":"IF(E9=0,0,E10/E9)","v":4.1116005873715125E-2},"(2)"]
[null,null,null,"Exprimés",653,{"$f":"IF(E7=0,0,E11/E7)","v":0.53877887788778878},"(3)"]
[null,null,null,{"$f":"Candidats!$A2&\" \"&Candidats!$B2","v":"Bertrand CHEVALIER"},18,{"$f":"IF(E$11=0,0,E12/E$11)","v":2.7565084226646247E-2},"(4)"]
[null,null,null,{"$f":"Candidats!$A3&\" \"&Candidats!$B3","v":"Marc ARCHAMBAULT"},115,0.17611026033690658]
[null,null,null,{"$f":"Candidats!$A4&\" \"&Candidats!$B4","v":"Étienne BUTZBACH"},122,0.18683001531393567]
[null,null,null,{"$f":"Candidats!$A5&\" \"&Candidats!$B5","v":"Bastien FAUDOT"},51,7.8101071975497705E-2]
[null,null,null,{"$f":"Candidats!$A6&\" \"&Candidats!$B6","v":"Christophe GRUDLER"},92,0.14088820826952528]
[null,null,null,{"$f":"Candidats!$A7&\" \"&Candidats!$B7","v":"Jean-Marie PHEULPIN"},14,2.1439509954058193E-2]
[null,null,null,{"$f":"Candidats!$A8&\" \"&Candidats!$B8","v":"Damien MESLOT"},241,0.36906584992343033]
[null,null,null,null,{"$f":"IF(SUM(E12:E18)<>E11,\"!!! FAUX\",\"\")","v":""}]
[null,null,null,"TOTAL  :",{"$f":"SUM(E12:E18)","v":653}]
[]
[null,null,null,null,null,"(1) Votants / Inscrits"]
[null,null,null,null,null,"(2) Nuls / Votants"]
[null,null,null,null,null,"(3) Exprimés / Inscrits"]
[null,null,null,null,null,"(4) Score / Exprimés"]

{"sheet":"E3","index":15,"n_rows":25,"n_cols":7,"rows_kept":25,"cut":false,"hidden":false,"merged":[]}
[]
[]
["E3","-","GROUPE SCOLAIRE RAYMOND AUBERT (Rue de la 1ère Armée Française)"]
[]
[]
[]
[null,null,null,"INSCRITS",1038,"%"]
[null,null,null,"Émargements",564]
[null,null,null,"Votants (participation)",564,{"$f":"IF(E7=0,0,E9/E7)","v":0.54335260115606931},"(1)"]
[null,null,null,"Nuls",24,{"$f":"IF(E9=0,0,E10/E9)","v":4.2553191489361701E-2},"(2)"]
[null,null,null,"Exprimés",540,{"$f":"IF(E7=0,0,E11/E7)","v":0.52023121387283233},"(3)"]
[null,null,null,{"$f":"Candidats!$A2&\" \"&Candidats!$B2","v":"Bertrand CHEVALIER"},21,{"$f":"IF(E$11=0,0,E12/E$11)","v":3.888888888888889E-2},"(4)"]
[null,null,null,{"$f":"Candidats!$A3&\" \"&Candidats!$B3","v":"Marc ARCHAMBAULT"},94,0.17407407407407408]
[null,null,null,{"$f":"Candidats!$A4&\" \"&Candidats!$B4","v":"Étienne BUTZBACH"},121,0.22407407407407406]
[null,null,null,{"$f":"Candidats!$A5&\" \"&Candidats!$B5","v":"Bastien FAUDOT"},60,0.1111111111111111]
[null,null,null,{"$f":"Candidats!$A6&\" \"&Candidats!$B6","v":"Christophe GRUDLER"},61,0.11296296296296296]
[null,null,null,{"$f":"Candidats!$A7&\" \"&Candidats!$B7","v":"Jean-Marie PHEULPIN"},16,2.9629629629629631E-2]
[null,null,null,{"$f":"Candidats!$A8&\" \"&Candidats!$B8","v":"Damien MESLOT"},167,0.30925925925925923]
[null,null,null,null,{"$f":"IF(SUM(E12:E18)<>E11,\"!!! FAUX\",\"\")","v":""}]
[null,null,null,"TOTAL  :",{"$f":"SUM(E12:E18)","v":540}]
[]
[null,null,null,null,null,"(1) Votants / Inscrits"]
[null,null,null,null,null,"(2) Nuls / Votants"]
[null,null,null,null,null,"(3) Exprimés / Inscrits"]
[null,null,null,null,null,"(4) Score / Exprimés"]

{"sheet":"F1","index":16,"n_rows":25,"n_cols":7,"rows_kept":25,"cut":false,"hidden":false,"merged":[]}
[]
[]
["F1","-","MAISON DE L'ENFANT (Rue Salvador Allendé)"]
[]
[]
[]
[null,null,null,"INSCRITS",776,"%"]
[null,null,null,"Émargements",459]
[null,null,null,"Votants (participation)",459,{"$f":"IF(E7=0,0,E9/E7)","v":0.59149484536082475},"(1)"]
[null,null,null,"Nuls",18,{"$f":"IF(E9=0,0,E10/E9)","v":3.9215686274509803E-2},"(2)"]
[null,null,null,"Exprimés",441,{"$f":"IF(E7=0,0,E11/E7)","v":0.56829896907216493},"(3)"]
[null,null,null,{"$f":"Candidats!$A2&\" \"&Candidats!$B2","v":"Bertrand CHEVALIER"},29,{"$f":"IF(E$11=0,0,E12/E$11)","v":6.5759637188208611E-2},"(4)"]
[null,null,null,{"$f":"Candidats!$A3&\" \"&Candidats!$B3","v":"Marc ARCHAMBAULT"},57,0.12925170068027211]
[null,null,null,{"$f":"Candidats!$A4&\" \"&Candidats!$B4","v":"Étienne BUTZBACH"},106,0.24036281179138322]
[null,null,null,{"$f":"Candidats!$A5&\" \"&Candidats!$B5","v":"Bastien FAUDOT"},31,7.029478458049887E-2]
[null,null,null,{"$f":"Candidats!$A6&\" \"&Candidats!$B6","v":"Christophe GRUDLER"},94,0.21315192743764172]
[null,null,null,{"$f":"Candidats!$A7&\" \"&Candidats!$B7","v":"Jean-Marie PHEULPIN"},9,2.0408163265306121E-2]
[null,null,null,{"$f":"Candidats!$A8&\" \"&Candidats!$B8","v":"Damien MESLOT"},115,0.26077097505668934]
[null,null,null,null,{"$f":"IF(SUM(E12:E18)<>E11,\"!!! FAUX\",\"\")","v":""}]
[null,null,null,"TOTAL  :",{"$f":"SUM(E12:E18)","v":441}]
[]
[null,null,null,null,null,"(1) Votants / Inscrits"]
[null,null,null,null,null,"(2) Nuls / Votants"]
[null,null,null,null,null,"(3) Exprimés / Inscrits"]
[null,null,null,null,null,"(4) Score / Exprimés"]

{"sheet":"F2","index":17,"n_rows":25,"n_cols":7,"rows_kept":25,"cut":false,"hidden":false,"merged":[]}
[]
[]
["F2","-","GROUPE SCOLAIRE ÉMILE GEHANT (Avenue des Frères Lumière)"]
[]
[]
[]
[null,null,null,"INSCRITS",522,"%"]
[null,null,null,"Émargements",299]
[null,null,null,"Votants (participation)",299,{"$f":"IF(E7=0,0,E9/E7)","v":0.57279693486590033},"(1)"]
[null,null,null,"Nuls",13,{"$f":"IF(E9=0,0,E10/E9)","v":4.3478260869565216E-2},"(2)"]
[null,null,null,"Exprimés",286,{"$f":"IF(E7=0,0,E11/E7)","v":0.54789272030651337},"(3)"]
[null,null,null,{"$f":"Candidats!$A2&\" \"&Candidats!$B2","v":"Bertrand CHEVALIER"},27,{"$f":"IF(E$11=0,0,E12/E$11)","v":9.4405594405594401E-2},"(4)"]
[null,null,null,{"$f":"Candidats!$A3&\" \"&Candidats!$B3","v":"Marc ARCHAMBAULT"},53,0.18531468531468531]
[null,null,null,{"$f":"Candidats!$A4&\" \"&Candidats!$B4","v":"Étienne BUTZBACH"},49,0.17132867132867133]
[null,null,null,{"$f":"Candidats!$A5&\" \"&Candidats!$B5","v":"Bastien FAUDOT"},34,0.11888111888111888]
[null,null,null,{"$f":"Candidats!$A6&\" \"&Candidats!$B6","v":"Christophe GRUDLER"},40,0.13986013986013987]
[null,null,null,{"$f":"Candidats!$A7&\" \"&Candidats!$B7","v":"Jean-Marie PHEULPIN"},24,8.3916083916083919E-2]
[null,null,null,{"$f":"Candidats!$A8&\" \"&Candidats!$B8","v":"Damien MESLOT"},59,0.2062937062937063]
[null,null,null,null,{"$f":"IF(SUM(E12:E18)<>E11,\"!!! FAUX\",\"\")","v":""}]
[null,null,null,"TOTAL  :",{"$f":"SUM(E12:E18)","v":286}]
[]
[null,null,null,null,null,"(1) Votants / Inscrits"]
[null,null,null,null,null,"(2) Nuls / Votants"]
[null,null,null,null,null,"(3) Exprimés / Inscrits"]
[null,null,null,null,null,"(4) Score / Exprimés"]

{"sheet":"G1","index":18,"n_rows":25,"n_cols":7,"rows_kept":25,"cut":false,"hidden":false,"merged":[]}
[]
[]
["G1","-","GROUPE SCOLAIRE HUBERT METZGER (La Pépinière - Rue Cuvier)"]
[]
[]
[]
[null,null,null,"INSCRITS",653,"%"]
[null,null,null,"Émargements",414]
[null,null,null,"Votants (participation)",414,{"$f":"IF(E7=0,0,E9/E7)","v":0.63399693721286365},"(1)"]
[null,null,null,"Nuls",18,{"$f":"IF(E9=0,0,E10/E9)","v":4.3478260869565216E-2},"(2)"]
[null,null,null,"Exprimés",396,{"$f":"IF(E7=0,0,E11/E7)","v":0.60643185298621749},"(3)"]
[null,null,null,{"$f":"Candidats!$A2&\" \"&Candidats!$B2","v":"Bertrand CHEVALIER"},36,{"$f":"IF(E$11=0,0,E12/E$11)","v":9.0909090909090912E-2},"(4)"]
[null,null,null,{"$f":"Candidats!$A3&\" \"&Candidats!$B3","v":"Marc ARCHAMBAULT"},54,0.13636363636363635]
[null,null,null,{"$f":"Candidats!$A4&\" \"&Candidats!$B4","v":"Étienne BUTZBACH"},97,0.24494949494949494]
[null,null,null,{"$f":"Candidats!$A5&\" \"&Candidats!$B5","v":"Bastien FAUDOT"},33,8.3333333333333329E-2]
[null,null,null,{"$f":"Candidats!$A6&\" \"&Candidats!$B6","v":"Christophe GRUDLER"},68,0.17171717171717171]
[null,null,null,{"$f":"Candidats!$A7&\" \"&Candidats!$B7","v":"Jean-Marie PHEULPIN"},9,2.2727272727272728E-2]
[null,null,null,{"$f":"Candidats!$A8&\" \"&Candidats!$B8","v":"Damien MESLOT"},99,0.25]
[null,null,null,null,{"$f":"IF(SUM(E12:E18)<>E11,\"!!! FAUX\",\"\")","v":""}]
[null,null,null,"TOTAL  :",{"$f":"SUM(E12:E18)","v":396}]
[]
[null,null,null,null,null,"(1) Votants / Inscrits"]
[null,null,null,null,null,"(2) Nuls / Votants"]
[null,null,null,null,null,"(3) Exprimés / Inscrits"]
[null,null,null,null,null,"(4) Score / Exprimés"]

{"sheet":"G2","index":19,"n_rows":25,"n_cols":7,"rows_kept":25,"cut":false,"hidden":false,"merged":[]}
[]
[]
["G2","-","GROUPE SCOLAIRE HUBERT METZGER (La Pépinière - Rue Claude Bernard)"]
[]
[]
[]
[null,null,null,"INSCRITS",755,"%"]
[null,null,null,"Émargements",419]
[null,null,null,"Votants (participation)",419,{"$f":"IF(E7=0,0,E9/E7)","v":0.55496688741721856},"(1)"]
[null,null,null,"Nuls",15,{"$f":"IF(E9=0,0,E10/E9)","v":3.5799522673031027E-2},"(2)"]
[null,null,null,"Exprimés",404,{"$f":"IF(E7=0,0,E11/E7)","v":0.53509933774834439},"(3)"]
[null,null,null,{"$f":"Candidats!$A2&\" \"&Candidats!$B2","v":"Bertrand CHEVALIER"},59,{"$f":"IF(E$11=0,0,E12/E$11)","v":0.14603960396039603},"(4)"]
[null,null,null,{"$f":"Candidats!$A3&\" \"&Candidats!$B3","v":"Marc ARCHAMBAULT"},64,0.15841584158415842]
[null,null,null,{"$f":"Candidats!$A4&\" \"&Candidats!$B4","v":"Étienne BUTZBACH"},97,0.24009900990099009]
[null,null,null,{"$f":"Candidats!$A5&\" \"&Candidats!$B5","v":"Bastien FAUDOT"},31,7.6732673267326731E-2]
[null,null,null,{"$f":"Candidats!$A6&\" \"&Candidats!$B6","v":"Christophe GRUDLER"},50,0.12376237623762376]
[null,null,null,{"$f":"Candidats!$A7&\" \"&Candidats!$B7","v":"Jean-Marie PHEULPIN"},6,1.4851485148514851E-2]
[null,null,null,{"$f":"Candidats!$A8&\" \"&Candidats!$B8","v":"Damien MESLOT"},97,0.24009900990099009]
[null,null,null,null,{"$f":"IF(SUM(E12:E18)<>E11,\"!!! FAUX\",\"\")","v":""}]
[null,null,null,"TOTAL  :",{"$f":"SUM(E12:E18)","v":404}]
[]
[null,null,null,null,null,"(1) Votants / Inscrits"]
[null,null,null,null,null,"(2) Nuls / Votants"]
[null,null,null,null,null,"(3) Exprimés / Inscrits"]
[null,null,null,null,null,"(4) Score / Exprimés"]

{"sheet":"H1","index":20,"n_rows":25,"n_cols":7,"rows_kept":25,"cut":false,"hidden":false,"merged":[]}
[]
[]
["H1","-","ANNEXE DU COLLÈGE LÉONARD DE VINCI (Faubourg de Lyon)"]
[]
[]
[]
[null,null,null,"INSCRITS",1042,"%"]
[null,null,null,"Émargements",574]
[null,null,null,"Votants (participation)",574,{"$f":"IF(E7=0,0,E9/E7)","v":0.55086372360844527},"(1)"]
[null,null,null,"Nuls",26,{"$f":"IF(E9=0,0,E10/E9)","v":4.5296167247386762E-2},"(2)"]
[null,null,null,"Exprimés",548,{"$f":"IF(E7=0,0,E11/E7)","v":0.52591170825335898},"(3)"]
[null,null,null,{"$f":"Candidats!$A2&\" \"&Candidats!$B2","v":"Bertrand CHEVALIER"},29,{"$f":"IF(E$11=0,0,E12/E$11)","v":5.2919708029197078E-2},"(4)"]
[null,null,null,{"$f":"Candidats!$A3&\" \"&Candidats!$B3","v":"Marc ARCHAMBAULT"},64,0.11678832116788321]
[null,null,null,{"$f":"Candidats!$A4&\" \"&Candidats!$B4","v":"Étienne BUTZBACH"},133,0.24270072992700731]
[null,null,null,{"$f":"Candidats!$A5&\" \"&Candidats!$B5","v":"Bastien FAUDOT"},61,0.11131386861313869]
[null,null,null,{"$f":"Candidats!$A6&\" \"&Candidats!$B6","v":"Christophe GRUDLER"},64,0.11678832116788321]
[null,null,null,{"$f":"Candidats!$A7&\" \"&Candidats!$B7","v":"Jean-Marie PHEULPIN"},15,2.7372262773722629E-2]
[null,null,null,{"$f":"Candidats!$A8&\" \"&Candidats!$B8","v":"Damien MESLOT"},182,0.33211678832116787]
[null,null,null,null,{"$f":"IF(SUM(E12:E18)<>E11,\"!!! FAUX\",\"\")","v":""}]
[null,null,null,"TOTAL  :",{"$f":"SUM(E12:E18)","v":548}]
[]
[null,null,null,null,null,"(1) Votants / Inscrits"]
[null,null,null,null,null,"(2) Nuls / Votants"]
[null,null,null,null,null,"(3) Exprimés / Inscrits"]
[null,null,null,null,null,"(4) Score / Exprimés"]

{"sheet":"J1","index":21,"n_rows":25,"n_cols":7,"rows_kept":25,"cut":false,"hidden":false,"merged":[]}
[]
[]
["J1","-","GROUPE SCOLAIRE RENÉ RUCKLIN (Rue Braille)"]
[]
[]
[]
[null,null,null,"INSCRITS",597,"%"]
[null,null,null,"Émargements",266]
[null,null,null,"Votants (participation)",266,{"$f":"IF(E7=0,0,E9/E7)","v":0.44556113902847572},"(1)"]
[null,null,null,"Nuls",9,{"$f":"IF(E9=0,0,E10/E9)","v":3.3834586466165412E-2},"(2)"]
[null,null,null,"Exprimés",257,{"$f":"IF(E7=0,0,E11/E7)","v":0.4304857621440536},"(3)"]
[null,null,null,{"$f":"Candidats!$A2&\" \"&Candidats!$B2","v":"Bertrand CHEVALIER"},7,{"$f":"IF(E$11=0,0,E12/E$11)","v":2.7237354085603113E-2},"(4)"]
[null,null,null,{"$f":"Candidats!$A3&\" \"&Candidats!$B3","v":"Marc ARCHAMBAULT"},50,0.19455252918287938]
[null,null,null,{"$f":"Candidats!$A4&\" \"&Candidats!$B4","v":"Étienne BUTZBACH"},63,0.24513618677042801]
[null,null,null,{"$f":"Candidats!$A5&\" \"&Candidats!$B5","v":"Bastien FAUDOT"},28,0.10894941634241245]
[null,null,null,{"$f":"Candidats!$A6&\" \"&Candidats!$B6","v":"Christophe GRUDLER"},43,0.16731517509727625]
[null,null,null,{"$f":"Candidats!$A7&\" \"&Candidats!$B7","v":"Jean-Marie PHEULPIN"},3,1.1673151750972763E-2]
[null,null,null,{"$f":"Candidats!$A8&\" \"&Candidats!$B8","v":"Damien MESLOT"},63,0.24513618677042801]
[null,null,null,null,{"$f":"IF(SUM(E12:E18)<>E11,\"!!! FAUX\",\"\")","v":""}]
[null,null,null,"TOTAL  :",{"$f":"SUM(E12:E18)","v":257}]
[]
[null,null,null,null,null,"(1) Votants / Inscrits"]
[null,null,null,null,null,"(2) Nuls / Votants"]
[null,null,null,null,null,"(3) Exprimés / Inscrits"]
[null,null,null,null,null,"(4) Score / Exprimés"]

{"sheet":"J2","index":22,"n_rows":25,"n_cols":7,"rows_kept":25,"cut":false,"hidden":false,"merged":[]}
[]
[]
["J2","-","GROUPE SCOLAIRE RENÉ RUCKLIN (Rue Braille)"]
[]
[]
[]
[null,null,null,"INSCRITS",818,"%"]
[null,null,null,"Émargements",438]
[null,null,null,"Votants (participation)",438,{"$f":"IF(E7=0,0,E9/E7)","v":0.53545232273838628},"(1)"]
[null,null,null,"Nuls",14,{"$f":"IF(E9=0,0,E10/E9)","v":3.1963470319634701E-2},"(2)"]
[null,null,null,"Exprimés",424,{"$f":"IF(E7=0,0,E11/E7)","v":0.51833740831295838},"(3)"]
[null,null,null,{"$f":"Candidats!$A2&\" \"&Candidats!$B2","v":"Bertrand CHEVALIER"},8,{"$f":"IF(E$11=0,0,E12/E$11)","v":1.8867924528301886E-2},"(4)"]
[null,null,null,{"$f":"Candidats!$A3&\" \"&Candidats!$B3","v":"Marc ARCHAMBAULT"},42,9.9056603773584911E-2]
[null,null,null,{"$f":"Candidats!$A4&\" \"&Candidats!$B4","v":"Étienne BUTZBACH"},102,0.24056603773584906]
[null,null,null,{"$f":"Candidats!$A5&\" \"&Candidats!$B5","v":"Bastien FAUDOT"},43,0.10141509433962265]
[null,null,null,{"$f":"Candidats!$A6&\" \"&Candidats!$B6","v":"Christophe GRUDLER"},79,0.18632075471698112]
[null,null,null,{"$f":"Candidats!$A7&\" \"&Candidats!$B7","v":"Jean-Marie PHEULPIN"},13,3.0660377358490566E-2]
[null,null,null,{"$f":"Candidats!$A8&\" \"&Candidats!$B8","v":"Damien MESLOT"},137,0.32311320754716982]
[null,null,null,null,{"$f":"IF(SUM(E12:E18)<>E11,\"!!! FAUX\",\"\")","v":""}]
[null,null,null,"TOTAL  :",{"$f":"SUM(E12:E18)","v":424}]
[]
[null,null,null,null,null,"(1) Votants / Inscrits"]
[null,null,null,null,null,"(2) Nuls / Votants"]
[null,null,null,null,null,"(3) Exprimés / Inscrits"]
[null,null,null,null,null,"(4) Score / Exprimés"]

{"sheet":"J3","index":23,"n_rows":25,"n_cols":7,"rows_kept":25,"cut":false,"hidden":false,"merged":[]}
[]
[]
["J3","-","GROUPE SCOLAIRE RENÉ RUCKLIN (Rue de Rome)"]
[]
[]
[]
[null,null,null,"INSCRITS",562,"%"]
[null,null,null,"Émargements",277]
[null,null,null,"Votants (participation)",277,{"$f":"IF(E7=0,0,E9/E7)","v":0.49288256227758009},"(1)"]
[null,null,null,"Nuls",20,{"$f":"IF(E9=0,0,E10/E9)","v":7.2202166064981949E-2},"(2)"]
[null,null,null,"Exprimés",257,{"$f":"IF(E7=0,0,E11/E7)","v":0.45729537366548045},"(3)"]
[null,null,null,{"$f":"Candidats!$A2&\" \"&Candidats!$B2","v":"Bertrand CHEVALIER"},17,{"$f":"IF(E$11=0,0,E12/E$11)","v":6.6147859922178989E-2},"(4)"]
[null,null,null,{"$f":"Candidats!$A3&\" \"&Candidats!$B3","v":"Marc ARCHAMBAULT"},26,0.10116731517509728]
[null,null,null,{"$f":"Candidats!$A4&\" \"&Candidats!$B4","v":"Étienne BUTZBACH"},88,0.34241245136186771]
[null,null,null,{"$f":"Candidats!$A5&\" \"&Candidats!$B5","v":"Bastien FAUDOT"},35,0.13618677042801555]
[null,null,null,{"$f":"Candidats!$A6&\" \"&Candidats!$B6","v":"Christophe GRUDLER"},29,0.11284046692607004]
[null,null,null,{"$f":"Candidats!$A7&\" \"&Candidats!$B7","v":"Jean-Marie PHEULPIN"},2,7.7821011673151752E-3]
[null,null,null,{"$f":"Candidats!$A8&\" \"&Candidats!$B8","v":"Damien MESLOT"},60,0.23346303501945526]
[null,null,null,null,{"$f":"IF(SUM(E12:E18)<>E11,\"!!! FAUX\",\"\")","v":""}]
[null,null,null,"TOTAL  :",{"$f":"SUM(E12:E18)","v":257}]
[]
[null,null,null,null,null,"(1) Votants / Inscrits"]
[null,null,null,null,null,"(2) Nuls / Votants"]
[null,null,null,null,null,"(3) Exprimés / Inscrits"]
[null,null,null,null,null,"(4) Score / Exprimés"]

{"sheet":"K1","index":24,"n_rows":25,"n_cols":7,"rows_kept":25,"cut":false,"hidden":false,"merged":[]}
[]
[]
["K1","-","GROUPE SCOLAIRE LOUIS PERGAUD (Rue de Zaporojie - Primaire)"]
[]
[]
[]
[null,null,null,"INSCRITS",959,"%"]
[null,null,null,"Émargements",487]
[null,null,null,"Votants (participation)",487,{"$f":"IF(E7=0,0,E9/E7)","v":0.50782064650677794},"(1)"]
[null,null,null,"Nuls",18,{"$f":"IF(E9=0,0,E10/E9)","v":3.6960985626283367E-2},"(2)"]
[null,null,null,"Exprimés",469,{"$f":"IF(E7=0,0,E11/E7)","v":0.48905109489051096},"(3)"]
[null,null,null,{"$f":"Candidats!$A2&\" \"&Candidats!$B2","v":"Bertrand CHEVALIER"},11,{"$f":"IF(E$11=0,0,E12/E$11)","v":2.3454157782515993E-2},"(4)"]
[null,null,null,{"$f":"Candidats!$A3&\" \"&Candidats!$B3","v":"Marc ARCHAMBAULT"},53,0.11300639658848614]
[null,null,null,{"$f":"Candidats!$A4&\" \"&Candidats!$B4","v":"Étienne BUTZBACH"},153,0.32622601279317698]
[null,null,null,{"$f":"Candidats!$A5&\" \"&Candidats!$B5","v":"Bastien FAUDOT"},39,8.3155650319829424E-2]
[null,null,null,{"$f":"Candidats!$A6&\" \"&Candidats!$B6","v":"Christophe GRUDLER"},30,6.3965884861407252E-2]
[null,null,null,{"$f":"Candidats!$A7&\" \"&Candidats!$B7","v":"Jean-Marie PHEULPIN"},10,2.1321961620469083E-2]
[null,null,null,{"$f":"Candidats!$A8&\" \"&Candidats!$B8","v":"Damien MESLOT"},173,0.36886993603411516]
[null,null,null,null,{"$f":"IF(SUM(E12:E18)<>E11,\"!!! FAUX\",\"\")","v":""}]
[null,null,null,"TOTAL  :",{"$f":"SUM(E12:E18)","v":469}]
[]
[null,null,null,null,null,"(1) Votants / Inscrits"]
[null,null,null,null,null,"(2) Nuls / Votants"]
[null,null,null,null,null,"(3) Exprimés / Inscrits"]
[null,null,null,null,null,"(4) Score / Exprimés"]

{"sheet":"K2","index":25,"n_rows":25,"n_cols":7,"rows_kept":25,"cut":false,"hidden":false,"merged":[]}
[]
[]
["K2","-","GROUPE SCOLAIRE LOUIS PERGAUD (Rue de Zaporojie - Maternelle)"]
[]
[]
[]
[null,null,null,"INSCRITS",789,"%"]
[null,null,null,"Émargements",395]
[null,null,null,"Votants (participation)",395,{"$f":"IF(E7=0,0,E9/E7)","v":0.50063371356147024},"(1)"]
[null,null,null,"Nuls",12,{"$f":"IF(E9=0,0,E10/E9)","v":3.0379746835443037E-2},"(2)"]
[null,null,null,"Exprimés",383,{"$f":"IF(E7=0,0,E11/E7)","v":0.48542458808618505},"(3)"]
[null,null,null,{"$f":"Candidats!$A2&\" \"&Candidats!$B2","v":"Bertrand CHEVALIER"},9,{"$f":"IF(E$11=0,0,E12/E$11)","v":2.3498694516971279E-2},"(4)"]
[null,null,null,{"$f":"Candidats!$A3&\" \"&Candidats!$B3","v":"Marc ARCHAMBAULT"},46,0.12010443864229765]
[null,null,null,{"$f":"Candidats!$A4&\" \"&Candidats!$B4","v":"Étienne BUTZBACH"},128,0.33420365535248042]
[null,null,null,{"$f":"Candidats!$A5&\" \"&Candidats!$B5","v":"Bastien FAUDOT"},30,7.8328981723237601E-2]
[null,null,null,{"$f":"Candidats!$A6&\" \"&Candidats!$B6","v":"Christophe GRUDLER"},28,7.3107049608355096E-2]
[null,null,null,{"$f":"Candidats!$A7&\" \"&Candidats!$B7","v":"Jean-Marie PHEULPIN"},9,2.3498694516971279E-2]
[null,null,null,{"$f":"Candidats!$A8&\" \"&Candidats!$B8","v":"Damien MESLOT"},133,0.3472584856396867]
[null,null,null,null,{"$f":"IF(SUM(E12:E18)<>E11,\"!!! FAUX\",\"\")","v":""}]
[null,null,null,"TOTAL  :",{"$f":"SUM(E12:E18)","v":383}]
[]
[null,null,null,null,null,"(1) Votants / Inscrits"]
[null,null,null,null,null,"(2) Nuls / Votants"]
[null,null,null,null,null,"(3) Exprimés / Inscrits"]
[null,null,null,null,null,"(4) Score / Exprimés"]

{"sheet":"L1","index":26,"n_rows":25,"n_cols":7,"rows_kept":25,"cut":false,"hidden":false,"merged":[]}
[]
[]
["L1","-","LES BARRES - MATERNELLE (Via d'Auxelles)"]
[]
[]
[]
[null,null,null,"INSCRITS",1336,"%"]
[null,null,null,"Émargements",759]
[null,null,null,"Votants (participation)",759,{"$f":"IF(E7=0,0,E9/E7)","v":0.56811377245508987},"(1)"]
[null,null,null,"Nuls",19,{"$f":"IF(E9=0,0,E10/E9)","v":2.5032938076416336E-2},"(2)"]
[null,null,null,"Exprimés",740,{"$f":"IF(E7=0,0,E11/E7)","v":0.55389221556886226},"(3)"]
[null,null,null,{"$f":"Candidats!$A2&\" \"&Candidats!$B2","v":"Bertrand CHEVALIER"},34,{"$f":"IF(E$11=0,0,E12/E$11)","v":4.5945945945945948E-2},"(4)"]
[null,null,null,{"$f":"Candidats!$A3&\" \"&Candidats!$B3","v":"Marc ARCHAMBAULT"},108,0.14594594594594595]
[null,null,null,{"$f":"Candidats!$A4&\" \"&Candidats!$B4","v":"Étienne BUTZBACH"},143,0.19324324324324324]
[null,null,null,{"$f":"Candidats!$A5&\" \"&Candidats!$B5","v":"Bastien FAUDOT"},132,0.17837837837837839]
[null,null,null,{"$f":"Candidats!$A6&\" \"&Candidats!$B6","v":"Christophe GRUDLER"},97,0.13108108108108107]
[null,null,null,{"$f":"Candidats!$A7&\" \"&Candidats!$B7","v":"Jean-Marie PHEULPIN"},16,2.1621621621621623E-2]
[null,null,null,{"$f":"Candidats!$A8&\" \"&Candidats!$B8","v":"Damien MESLOT"},210,0.28378378378378377]
[null,null,null,null,{"$f":"IF(SUM(E12:E18)<>E11,\"!!! FAUX\",\"\")","v":""}]
[null,null,null,"TOTAL  :",{"$f":"SUM(E12:E18)","v":740}]
[]
[null,null,null,null,null,"(1) Votants / Inscrits"]
[null,null,null,null,null,"(2) Nuls / Votants"]
[null,null,null,null,null,"(3) Exprimés / Inscrits"]
[null,null,null,null,null,"(4) Score / Exprimés"]

{"sheet":"L2","index":27,"n_rows":25,"n_cols":7,"rows_kept":25,"cut":false,"hidden":false,"merged":[]}
[]
[]
["L2","-","LES BARRES - PRIMAIRE (Rue Ernest Duvillard)"]
[]
[]
[]
[null,null,null,"INSCRITS",1155,"%"]
[null,null,null,"Émargements",709]
[null,null,null,"Votants (participation)",709,{"$f":"IF(E7=0,0,E9/E7)","v":0.61385281385281387},"(1)"]
[null,null,null,"Nuls",35,{"$f":"IF(E9=0,0,E10/E9)","v":4.9365303244005641E-2},"(2)"]
[null,null,null,"Exprimés",674,{"$f":"IF(E7=0,0,E11/E7)","v":0.5835497835497836},"(3)"]
[null,null,null,{"$f":"Candidats!$A2&\" \"&Candidats!$B2","v":"Bertrand CHEVALIER"},47,{"$f":"IF(E$11=0,0,E12/E$11)","v":6.9732937685459948E-2},"(4)"]
[null,null,null,{"$f":"Candidats!$A3&\" \"&Candidats!$B3","v":"Marc ARCHAMBAULT"},103,0.15281899109792285]
[null,null,null,{"$f":"Candidats!$A4&\" \"&Candidats!$B4","v":"Étienne BUTZBACH"},148,0.21958456973293769]
[null,null,null,{"$f":"Candidats!$A5&\" \"&Candidats!$B5","v":"Bastien FAUDOT"},86,0.12759643916913946]
[null,null,null,{"$f":"Candidats!$A6&\" \"&Candidats!$B6","v":"Christophe GRUDLER"},102,0.1513353115727003]
[null,null,null,{"$f":"Candidats!$A7&\" \"&Candidats!$B7","v":"Jean-Marie PHEULPIN"},18,2.6706231454005934E-2]
[null,null,null,{"$f":"Candidats!$A8&\" \"&Candidats!$B8","v":"Damien MESLOT"},170,0.25222551928783382]
[null,null,null,null,{"$f":"IF(SUM(E12:E18)<>E11,\"!!! FAUX\",\"\")","v":""}]
[null,null,null,"TOTAL  :",{"$f":"SUM(E12:E18)","v":674}]
[]
[null,null,null,null,null,"(1) Votants / Inscrits"]
[null,null,null,null,null,"(2) Nuls / Votants"]
[null,null,null,null,null,"(3) Exprimés / Inscrits"]
[null,null,null,null,null,"(4) Score / Exprimés"]

{"sheet":"EST","index":28,"n_rows":24,"n_cols":36,"rows_kept":24,"cut":false,"hidden":false,"merged":[[1,7,1,14],[2,18,2,19],[3,18,3,19],[3,22,3,23],[7,27,7,28],[7,24,7,25],[4,22,4,23],[7,21,7,22],[7,18,7,19],[7,15,7,16],[9,27,9,28],[9,15,9,16],[9,18,9,19],[9,21,9,22],[9,24,9,25],[8,24,8,25],[8,27,8,28],[8,15,8,16],[8,18,8,19],[8,21,8,22],[9,30,9,31],[9,33,9,34],[3,31,3,32],[4,31,4,32],[7,30,7,31],[7,33,7,34],[8,30,8,31],[8,33,8,34]]}
[]
[null,null,null,null,null,null,null,"CANTON  EST"]
[]
[]
[]
[]
[]
[null,null,null,null,null,null,null,null,null,null,null,null,null,null,null,{"$f":"Candidats!A2","v":"Bertrand"},null,null,{"$f":"Candidats!A3","v":"Marc"},null,null,{"$f":"Candidats!A4","v":"Étienne"},null,null,{"$f":"Candidats!A5","v":"Bastien"},null,null,{"$f":"Candidats!A6","v":"Christophe"},null,null,{"$f":"Candidats!A7","v":"Jean-Marie"},null,null,{"$f":"Candidats!A8","v":"Damien"}]
[null,null,null,"BUREAUX",null,null,"Inscrits",null,"Votants",null,"Particip.","Nuls",null,"Exprimés",null,{"$f":"Candidats!B2","v":"CHEVALIER"},null,"%",{"$f":"Candidats!B3","v":"ARCHAMBAULT"},null,"%",{"$f":"Candidats!B4","v":"BUTZBACH"},null,"%",{"$f":"Candidats!B5","v":"FAUDOT"},null,"%",{"$f":"Candidats!B6","v":"GRUDLER"},null,"%",{"$f":"Candidats!B7","v":"PHEULPIN"},null,"%",{"$f":"Candidats!B8","v":"MESLOT"},null,"%"]
[]
[]
[null,"A1","-"," Hôtel de Ville","E",null,{"$f":"IF('A1'!$E7=\"\",\"\",'A1'!$E7)","v":949},null,{"$f":"IF('A1'!$E9=\"\",\"\",'A1'!$E9)","v":508},null,{"$f":"IF(I12=\"\",\" \",I12/$G12)","v":0.53530031612223394},{"$f":"IF('A1'!$E10=\"\",\"\",'A1'!$E10)","v":12},null,{"$f":"IF('A1'!$E11=\"\",\"\",'A1'!$E11)","v":496},null,{"$f":"IF('A1'!$E12=\"\",\"\",'A1'!$E12)","v":20},null,{"$f":"IF(P12=\"\",\" \",P12/$N12)","v":4.0322580645161289E-2},{"$f":"IF('A1'!$E13=\"\",\"\",'A1'!$E13)","v":32},null,{"$f":"IF(S12=\"\",\" \",S12/$N12)","v":6.4516129032258063E-2},{"$f":"IF('A1'!$E14=\"\",\"\",'A1'!$E14)","v":104},null,{"$f":"IF(V12=\"\",\" \",V12/$N12)","v":0.20967741935483872},{"$f":"IF('A1'!$E15=\"\",\"\",'A1'!$E15)","v":60},null,{"$f":"IF(Y12=\"\",\" \",Y12/$N12)","v":0.12096774193548387},{"$f":"IF('A1'!$E16=\"\",\"\",'A1'!$E16)","v":105},null,{"$f":"IF(AB12=\"\",\" \",AB12/$N12)","v":0.21169354838709678},{"$f":"IF('A1'!$E17=\"\",\"\",'A1'!$E17)","v":8},null,{"$f":"IF(AE12=\"\",\" \",AE12/$N12)","v":1.6129032258064516E-2},{"$f":"IF('A1'!$E18=\"\",\"\",'A1'!$E18)","v":167},null,{"$f":"IF(AH12=\"\",\" \",AH12/$N12)","v":0.33669354838709675}]
[null,"A2","-","Salle des fêtes ","E",null,{"$f":"IF('A2'!$E7=\"\",\"\",'A2'!$E7)","v":956},null,{"$f":"IF('A2'!$E9=\"\",\"\",'A2'!$E9)","v":610},null,{"$f":"IF(I13=\"\",\" \",I13/$G13)","v":0.63807531380753135},{"$f":"IF('A2'!$E10=\"\",\"\",'A2'!$E10)","v":18},null,{"$f":"IF('A2'!$E11=\"\",\"\",'A2'!$E11)","v":592},null,{"$f":"IF('A2'!$E12=\"\",\"\",'A2'!$E12)","v":29},null,4.8986486486486486E-2,{"$f":"IF('A2'!$E13=\"\",\"\",'A2'!$E13)","v":42},null,7.0945945945945943E-2,{"$f":"IF('A2'!$E14=\"\",\"\",'A2'!$E14)","v":107},null,0.18074324324324326,{"$f":"IF('A2'!$E15=\"\",\"\",'A2'!$E15)","v":69},null,0.11655405405405406,{"$f":"IF('A2'!$E16=\"\",\"\",'A2'!$E16)","v":105},null,0.17736486486486486,{"$f":"IF('A2'!$E17=\"\",\"\",'A2'!$E17)","v":7},null,1.1824324324324325E-2,{"$f":"IF('A2'!$E18=\"\",\"\",'A2'!$E18)","v":233},null,0.39358108108108109]
[null,"B1","-","Victor Hugo","E",null,{"$f":"IF('B1'!$E7=\"\",\"\",'B1'!$E7)","v":1096},null,{"$f":"IF('B1'!$E9=\"\",\"\",'B1'!$E9)","v":622},null,0.56751824817518248,{"$f":"IF('B1'!$E10=\"\",\"\",'B1'!$E10)","v":11},null,{"$f":"IF('B1'!$E11=\"\",\"\",'B1'!$E11)","v":611},null,{"$f":"IF('B1'!$E12=\"\",\"\",'B1'!$E12)","v":26},null,4.2553191489361701E-2,{"$f":"IF('B1'!$E13=\"\",\"\",'B1'!$E13)","v":46},null,7.5286415711947621E-2,{"$f":"IF('B1'!$E14=\"\",\"\",'B1'!$E14)","v":132},null,0.2160392798690671,{"$f":"IF('B1'!$E15=\"\",\"\",'B1'!$E15)","v":71},null,0.11620294599018004,{"$f":"IF('B1'!$E16=\"\",\"\",'B1'!$E16)","v":115},null,0.18821603927986907,{"$f":"IF('B1'!$E17=\"\",\"\",'B1'!$E17)","v":9},null,1.4729950900163666E-2,{"$f":"IF('B1'!$E18=\"\",\"\",'B1'!$E18)","v":212},null,0.34697217675941078]
[null,"B2","-","Victor Hugo","E",null,{"$f":"IF('B2'!$E7=\"\",\"\",'B2'!$E7)","v":1167},null,{"$f":"IF('B2'!$E9=\"\",\"\",'B2'!$E9)","v":715},null,0.61268209083119107,{"$f":"IF('B2'!$E10=\"\",\"\",'B2'!$E10)","v":15},null,{"$f":"IF('B2'!$E11=\"\",\"\",'B2'!$E11)","v":700},null,{"$f":"IF('B2'!$E12=\"\",\"\",'B2'!$E12)","v":37},null,5.2857142857142859E-2,{"$f":"IF('B2'!$E13=\"\",\"\",'B2'!$E13)","v":57},null,8.1428571428571433E-2,{"$f":"IF('B2'!$E14=\"\",\"\",'B2'!$E14)","v":126},null,0.18,{"$f":"IF('B2'!$E15=\"\",\"\",'B2'!$E15)","v":87},null,0.12428571428571429,{"$f":"IF('B2'!$E16=\"\",\"\",'B2'!$E16)","v":126},null,0.18,{"$f":"IF('B2'!$E17=\"\",\"\",'B2'!$E17)","v":12},null,1.7142857142857144E-2,{"$f":"IF('B2'!$E18=\"\",\"\",'B2'!$E18)","v":255},null,0.36428571428571427]
[null,"M1","-","Saint-Exupéry","E",null,{"$f":"IF('M1'!$E7=\"\",\"\",'M1'!$E7)","v":1306},null,{"$f":"IF('M1'!$E9=\"\",\"\",'M1'!$E9)","v":599},null,0.45865237366003064,{"$f":"IF('M1'!$E10=\"\",\"\",'M1'!$E10)","v":18},null,{"$f":"IF('M1'!$E11=\"\",\"\",'M1'!$E11)","v":581},null,{"$f":"IF('M1'!$E12=\"\",\"\",'M1'!$E12)","v":23},null,3.9586919104991396E-2,{"$f":"IF('M1'!$E13=\"\",\"\",'M1'!$E13)","v":50},null,8.6058519793459548E-2,{"$f":"IF('M1'!$E14=\"\",\"\",'M1'!$E14)","v":215},null,0.37005163511187605,{"$f":"IF('M1'!$E15=\"\",\"\",'M1'!$E15)","v":50},null,8.6058519793459548E-2,{"$f":"IF('M1'!$E16=\"\",\"\",'M1'!$E16)","v":112},null,0.19277108433734941,{"$f":"IF('M1'!$E17=\"\",\"\",'M1'!$E17)","v":8},null,1.3769363166953529E-2,{"$f":"IF('M1'!$E18=\"\",\"\",'M1'!$E18)","v":123},null,0.2117039586919105]
[null,"N1","-","Jean Moulin","E",null,{"$f":"IF('N1'!$E7=\"\",\"\",'N1'!$E7)","v":1456},null,{"$f":"IF('N1'!$E9=\"\",\"\",'N1'!$E9)","v":825},null,0.56662087912087911,{"$f":"IF('N1'!$E10=\"\",\"\",'N1'!$E10)","v":17},null,{"$f":"IF('N1'!$E11=\"\",\"\",'N1'!$E11)","v":808},null,{"$f":"IF('N1'!$E12=\"\",\"\",'N1'!$E12)","v":32},null,3.9603960396039604E-2,{"$f":"IF('N1'!$E13=\"\",\"\",'N1'!$E13)","v":111},null,0.13737623762376239,{"$f":"IF('N1'!$E14=\"\",\"\",'N1'!$E14)","v":150},null,0.18564356435643564,{"$f":"IF('N1'!$E15=\"\",\"\",'N1'!$E15)","v":78},null,9.6534653465346537E-2,{"$f":"IF('N1'!$E16=\"\",\"\",'N1'!$E16)","v":176},null,0.21782178217821782,{"$f":"IF('N1'!$E17=\"\",\"\",'N1'!$E17)","v":12},null,1.4851485148514851E-2,{"$f":"IF('N1'!$E18=\"\",\"\",'N1'!$E18)","v":249},null,0.30816831683168316]
[null,"N2","-","Cité des Associations","E",null,{"$f":"IF('N2'!$E7=\"\",\"\",'N2'!$E7)","v":905},null,{"$f":"IF('N2'!$E9=\"\",\"\",'N2'!$E9)","v":577},null,0.63756906077348063,{"$f":"IF('N2'!$E10=\"\",\"\",'N2'!$E10)","v":11},null,{"$f":"IF('N2'!$E11=\"\",\"\",'N2'!$E11)","v":566},null,{"$f":"IF('N2'!$E12=\"\",\"\",'N2'!$E12)","v":25},null,4.4169611307420496E-2,{"$f":"IF('N2'!$E13=\"\",\"\",'N2'!$E13)","v":44},null,7.7738515901060068E-2,{"$f":"IF('N2'!$E14=\"\",\"\",'N2'!$E14)","v":113},null,0.19964664310954064,{"$f":"IF('N2'!$E15=\"\",\"\",'N2'!$E15)","v":67},null,0.11837455830388692,{"$f":"IF('N2'!$E16=\"\",\"\",'N2'!$E16)","v":167},null,0.29505300353356889,{"$f":"IF('N2'!$E17=\"\",\"\",'N2'!$E17)","v":5},null,8.8339222614840993E-3,{"$f":"IF('N2'!$E18=\"\",\"\",'N2'!$E18)","v":145},null,0.25618374558303886]
[]
[null,"Total Canton EST",null,null,null,null,{"$f":"SUM(G$12:G$18)","v":7835},null,{"$f":"SUM(I12:I18)","v":4456},null,0.56873005743458838,{"$f":"SUM(L12:L18)","v":102},null,{"$f":"SUM(N12:N18)","v":4354},null,{"$f":"SUM(P12:P18)","v":192},null,{"$f":"IF(P20=0,\" \",P20/$N20)","v":4.4097381717960495E-2},{"$f":"SUM(S12:S18)","v":382},null,{"$f":"IF(S20=0,\" \",S20/$N20)","v":8.7735415709692233E-2},{"$f":"SUM(V12:V18)","v":947},null,{"$f":"IF(V20=0,\" \",V20/$N20)","v":0.21750114836931558},{"$f":"SUM(Y12:Y18)","v":482},null,{"$f":"IF(Y20=0,\" \",Y20/$N20)","v":0.11070280202112999},{"$f":"SUM(AB12:AB18)","v":906},null,{"$f":"IF(AB20=0,\" \",AB20/$N20)","v":0.20808451998162608},{"$f":"SUM(AE12:AE18)","v":61},null,{"$f":"IF(AE20=0,\" \",AE20/$N20)","v":1.4010105649977032E-2},{"$f":"SUM(AH12:AH18)","v":1384},null,{"$f":"IF(AH20=0,\" \",AH20/$N20)","v":0.31786862655029857}]
[]
[]
[null,"%  par rapport aux VOTANTS",null,null,null,null,null,null,null,null,null,{"$f":"IF(L20=0,\" \",L20/$I20)","v":2.289048473967684E-2},null,{"$f":"IF(N20=0,\" \",N20/$I20)","v":0.97710951526032319}]
[null,"%  par rapport aux INSCRITS",null,null,null,null,null,null,null,null,null,{"$f":"IF(L20=0,\" \",L20/$G20)","v":1.3018506700701978E-2},null,{"$f":"IF(N20=0,\" \",N20/$G20)","v":0.55571155073388645},null,{"$f":"IF(P20=0,\" \",P20/$G20)","v":2.4505424377791959E-2},null,null,{"$f":"IF(S20=0,\" \",S20/$G20)","v":4.8755583918315255E-2},null,null,{"$f":"IF(V20=0,\" \",V20/$G20)","v":0.12086790044671347},null,null,{"$f":"IF(Y20=0,\" \",Y20/$G20)","v":6.1518825781748561E-2},null,null,{"$f":"IF(AB20=0,\" \",AB20/$G20)","v":0.11563497128270581},null,null,{"$f":"IF(AE20=0,\" \",AE20/$G20)","v":7.7855775366943202E-3},null,null,{"$f":"IF(AH20=0,\" \",AH20/$G20)","v":0.17664326738991704}]

{"sheet":"CENTRE","index":29,"n_rows":23,"n_cols":36,"rows_kept":23,"cut":false,"hidden":false,"merged":[[9,30,9,31],[9,33,9,34],[7,30,7,31],[7,33,7,34],[8,30,8,31],[8,33,8,34],[9,27,9,28],[7,27,7,28],[8,27,8,28],[7,21,7,22],[8,21,8,22],[9,21,9,22],[8,24,8,25],[7,24,7,25],[9,24,9,25],[9,18,9,19],[8,18,8,19],[7,18,7,19],[1,7,1,14],[7,15,7,16],[8,15,8,16],[9,15,9,16]]}
[]
[null,null,null,null,null,null,null,"CANTON  CENTRE"]
[]
[]
[]
[]
[]
[null,null,null,null,null,null,null,null,null,null,null,null,null,null,null,{"$f":"Candidats!A2","v":"Bertrand"},null,null,{"$f":"Candidats!A3","v":"Marc"},null,null,{"$f":"Candidats!A4","v":"Étienne"},null,null,{"$f":"Candidats!A5","v":"Bastien"},null,null,{"$f":"Candidats!A6","v":"Christophe"},null,null,{"$f":"Candidats!A7","v":"Jean-Marie"},null,null,{"$f":"Candidats!A8","v":"Damien"}]
[null,null,null,"BUREAUX",null,null,"Inscrits",null,"Votants",null,"Particip.","Nuls",null,"Exprimés",null,{"$f":"Candidats!B2","v":"CHEVALIER"},null,"%",{"$f":"Candidats!B3","v":"ARCHAMBAULT"},null,"%",{"$f":"Candidats!B4","v":"BUTZBACH"},null,"%",{"$f":"Candidats!B5","v":"FAUDOT"},null,"%",{"$f":"Candidats!B6","v":"GRUDLER"},null,"%",{"$f":"Candidats!B7","v":"PHEULPIN"},null,"%",{"$f":"Candidats!B8","v":"MESLOT"},null,"%"]
[]
[]
[null,"C1","-","Victor Schoelcher","C",null,{"$f":"IF('C1'!$E7=\"\",\"\",'C1'!$E7)","v":1210},null,{"$f":"IF('C1'!$E9=\"\",\"\",'C1'!$E9)","v":719},null,{"$f":"IF(I12=\"\",\" \",I12/$G12)","v":0.59421487603305789},{"$f":"IF('C1'!$E10=\"\",\"\",'C1'!$E10)","v":17},null,{"$f":"IF('C1'!$E11=\"\",\"\",'C1'!$E11)","v":702},null,{"$f":"IF('C1'!$E12=\"\",\"\",'C1'!$E12)","v":24},null,{"$f":"IF(P12=\"\",\" \",P12/$N12)","v":3.4188034188034191E-2},{"$f":"IF('C1'!$E13=\"\",\"\",'C1'!$E13)","v":65},null,{"$f":"IF(S12=\"\",\" \",S12/$N12)","v":9.2592592592592587E-2},{"$f":"IF('C1'!$E14=\"\",\"\",'C1'!$E14)","v":153},null,{"$f":"IF(V12=\"\",\" \",V12/$N12)","v":0.21794871794871795},{"$f":"IF('C1'!$E15=\"\",\"\",'C1'!$E15)","v":89},null,{"$f":"IF(Y12=\"\",\" \",Y12/$N12)","v":0.12678062678062679},{"$f":"IF('C1'!$E16=\"\",\"\",'C1'!$E16)","v":92},null,{"$f":"IF(AB12=\"\",\" \",AB12/$N12)","v":0.13105413105413105},{"$f":"IF('C1'!$E17=\"\",\"\",'C1'!$E17)","v":9},null,{"$f":"IF(AE12=\"\",\" \",AE12/$N12)","v":1.282051282051282E-2},{"$f":"IF('C1'!$E18=\"\",\"\",'C1'!$E18)","v":270},null,{"$f":"IF(AH12=\"\",\" \",AH12/$N12)","v":0.38461538461538464}]
[null,"C2","-","Maison du Peuple","C",null,{"$f":"IF('C2'!$E7=\"\",\"\",'C2'!$E7)","v":763},null,{"$f":"IF('C2'!$E9=\"\",\"\",'C2'!$E9)","v":474},null,0.62123197903014415,{"$f":"IF('C2'!$E10=\"\",\"\",'C2'!$E10)","v":11},null,{"$f":"IF('C2'!$E11=\"\",\"\",'C2'!$E11)","v":463},null,{"$f":"IF('C2'!$E12=\"\",\"\",'C2'!$E12)","v":23},null,4.9676025917926567E-2,{"$f":"IF('C2'!$E13=\"\",\"\",'C2'!$E13)","v":43},null,9.2872570194384454E-2,{"$f":"IF('C2'!$E14=\"\",\"\",'C2'!$E14)","v":82},null,0.17710583153347731,{"$f":"IF('C2'!$E15=\"\",\"\",'C2'!$E15)","v":54},null,0.11663066954643629,{"$f":"IF('C2'!$E16=\"\",\"\",'C2'!$E16)","v":58},null,0.12526997840172785,{"$f":"IF('C2'!$E17=\"\",\"\",'C2'!$E17)","v":5},null,1.079913606911447E-2,{"$f":"IF('C2'!$E18=\"\",\"\",'C2'!$E18)","v":198},null,0.42764578833693306]
[null,"C3","-","Maison du Peuple","C",null,{"$f":"IF('C3'!$E7=\"\",\"\",'C3'!$E7)","v":921},null,{"$f":"IF('C3'!$E9=\"\",\"\",'C3'!$E9)","v":564},null,0.6123778501628665,{"$f":"IF('C3'!$E10=\"\",\"\",'C3'!$E10)","v":12},null,{"$f":"IF('C3'!$E11=\"\",\"\",'C3'!$E11)","v":552},null,{"$f":"IF('C3'!$E12=\"\",\"\",'C3'!$E12)","v":19},null,3.4420289855072464E-2,{"$f":"IF('C3'!$E13=\"\",\"\",'C3'!$E13)","v":48},null,{"$f":"IF(S14=\"\",\" \",S14/$N14)","v":8.6956521739130432E-2},{"$f":"IF('C3'!$E14=\"\",\"\",'C3'!$E14)","v":105},null,0.19021739130434784,{"$f":"IF('C3'!$E15=\"\",\"\",'C3'!$E15)","v":56},null,0.10144927536231885,{"$f":"IF('C3'!$E16=\"\",\"\",'C3'!$E16)","v":62},null,0.11231884057971014,{"$f":"IF('C3'!$E17=\"\",\"\",'C3'!$E17)","v":6},null,1.0869565217391304E-2,{"$f":"IF('C3'!$E18=\"\",\"\",'C3'!$E18)","v":256},null,0.46376811594202899]
[null,"D1","-","Châteaudun","C",null,{"$f":"IF('D1'!$E7=\"\",\"\",'D1'!$E7)","v":1074},null,{"$f":"IF('D1'!$E9=\"\",\"\",'D1'!$E9)","v":613},null,0.57076350093109873,{"$f":"IF('D1'!$E10=\"\",\"\",'D1'!$E10)","v":17},null,{"$f":"IF('D1'!$E11=\"\",\"\",'D1'!$E11)","v":596},null,{"$f":"IF('D1'!$E12=\"\",\"\",'D1'!$E12)","v":14},null,2.3489932885906041E-2,{"$f":"IF('D1'!$E13=\"\",\"\",'D1'!$E13)","v":70},null,0.1174496644295302,{"$f":"IF('D1'!$E14=\"\",\"\",'D1'!$E14)","v":103},null,0.17281879194630873,{"$f":"IF('D1'!$E15=\"\",\"\",'D1'!$E15)","v":51},null,8.557046979865772E-2,{"$f":"IF('D1'!$E16=\"\",\"\",'D1'!$E16)","v":80},null,0.13422818791946309,{"$f":"IF('D1'!$E17=\"\",\"\",'D1'!$E17)","v":7},null,1.1744966442953021E-2,{"$f":"IF('D1'!$E18=\"\",\"\",'D1'!$E18)","v":271},null,0.45469798657718119]
[null,"D2","-","Châteaudun","C",null,{"$f":"IF('D2'!$E7=\"\",\"\",'D2'!$E7)","v":838},null,{"$f":"IF('D2'!$E9=\"\",\"\",'D2'!$E9)","v":503},null,0.60023866348448685,{"$f":"IF('D2'!$E10=\"\",\"\",'D2'!$E10)","v":22},null,{"$f":"IF('D2'!$E11=\"\",\"\",'D2'!$E11)","v":481},null,{"$f":"IF('D2'!$E12=\"\",\"\",'D2'!$E12)","v":20},null,4.1580041580041582E-2,{"$f":"IF('D2'!$E13=\"\",\"\",'D2'!$E13)","v":56},null,0.11642411642411643,{"$f":"IF('D2'!$E14=\"\",\"\",'D2'!$E14)","v":67},null,0.1392931392931393,{"$f":"IF('D2'!$E15=\"\",\"\",'D2'!$E15)","v":56},null,0.11642411642411643,{"$f":"IF('D2'!$E16=\"\",\"\",'D2'!$E16)","v":78},null,0.16216216216216217,{"$f":"IF('D2'!$E17=\"\",\"\",'D2'!$E17)","v":7},null,1.4553014553014554E-2,{"$f":"IF('D2'!$E18=\"\",\"\",'D2'!$E18)","v":197},null,0.40956340956340959]
[null,"D3","-","Châteaudun","C",null,{"$f":"IF('D3'!$E7=\"\",\"\",'D3'!$E7)","v":912},null,{"$f":"IF('D3'!$E9=\"\",\"\",'D3'!$E9)","v":554},null,0.60745614035087714,{"$f":"IF('D3'!$E10=\"\",\"\",'D3'!$E10)","v":18},null,{"$f":"IF('D3'!$E11=\"\",\"\",'D3'!$E11)","v":536},null,{"$f":"IF('D3'!$E12=\"\",\"\",'D3'!$E12)","v":37},null,6.9029850746268662E-2,{"$f":"IF('D3'!$E13=\"\",\"\",'D3'!$E13)","v":91},null,0.16977611940298507,{"$f":"IF('D3'!$E14=\"\",\"\",'D3'!$E14)","v":70},null,0.13059701492537312,{"$f":"IF('D3'!$E15=\"\",\"\",'D3'!$E15)","v":47},null,8.7686567164179108E-2,{"$f":"IF('D3'!$E16=\"\",\"\",'D3'!$E16)","v":76},null,0.1417910447761194,{"$f":"IF('D3'!$E17=\"\",\"\",'D3'!$E17)","v":16},null,2.9850746268656716E-2,{"$f":"IF('D3'!$E18=\"\",\"\",'D3'!$E18)","v":199},null,0.3712686567164179]
[]
[null,"Total Canton CENTRE",null,null,null,null,{"$f":"SUM(G$12:G$17)","v":5718},null,{"$f":"SUM(I12:I17)","v":3427},null,{"$f":"IF(I19=\"\",\" \",I19/$G19)","v":0.59933543196922001},{"$f":"SUM(L12:L17)","v":97},null,{"$f":"SUM(N12:N17)","v":3330},null,{"$f":"SUM(P12:P17)","v":137},null,{"$f":"IF(P19=0,\" \",P19/$N19)","v":4.114114114114114E-2},{"$f":"SUM(S12:S17)","v":373},null,{"$f":"IF(S19=0,\" \",S19/$N19)","v":0.11201201201201201},{"$f":"SUM(V12:V17)","v":580},null,{"$f":"IF(V19=0,\" \",V19/$N19)","v":0.17417417417417416},{"$f":"SUM(Y12:Y17)","v":353},null,{"$f":"IF(Y19=0,\" \",Y19/$N19)","v":0.106006006006006},{"$f":"SUM(AB12:AB17)","v":446},null,{"$f":"IF(AB19=0,\" \",AB19/$N19)","v":0.13393393393393394},{"$f":"SUM(AE12:AE17)","v":50},null,{"$f":"IF(AE19=0,\" \",AE19/$N19)","v":1.5015015015015015E-2},{"$f":"SUM(AH12:AH17)","v":1391},null,{"$f":"IF(AH19=0,\" \",AH19/$N19)","v":0.41771771771771771}]
[]
[]
[null,"%  par rapport aux VOTANTS",null,null,null,null,null,null,null,null,null,{"$f":"IF(L19=0,\" \",L19/$I19)","v":2.8304639626495477E-2},null,{"$f":"IF(N19=0,\" \",N19/$I19)","v":0.97169536037350457}]
[null,"%  par rapport aux INSCRITS",null,null,null,null,null,null,null,null,null,{"$f":"IF(L19=0,\" \",L19/$G19)","v":1.6963973417278767E-2},null,{"$f":"IF(N19=0,\" \",N19/$G19)","v":0.58237145855194128},null,{"$f":"IF(P19=0,\" \",P19/$G19)","v":2.3959426372857643E-2},null,null,{"$f":"IF(S19=0,\" \",S19/$G19)","v":6.5232598810772993E-2},null,null,{"$f":"IF(V19=0,\" \",V19/$G19)","v":0.10143406785589366},null,null,{"$f":"IF(Y19=0,\" \",Y19/$G19)","v":6.1734872332983561E-2},null,null,{"$f":"IF(AB19=0,\" \",AB19/$G19)","v":7.7999300454704448E-2},null,null,{"$f":"IF(AE19=0,\" \",AE19/$G19)","v":8.744316194473592E-3},null,null,{"$f":"IF(AH19=0,\" \",AH19/$G19)","v":0.24326687653025533}]

{"sheet":"NORD","index":30,"n_rows":22,"n_cols":36,"rows_kept":22,"cut":false,"hidden":false,"merged":[[9,30,9,31],[9,33,9,34],[7,30,7,31],[7,33,7,34],[8,30,8,31],[8,33,8,34],[7,27,7,28],[8,27,8,28],[9,27,9,28],[7,21,7,22],[8,21,8,22],[9,21,9,22],[9,24,9,25],[9,15,9,16],[8,24,8,25],[7,24,7,25],[1,7,1,14],[7,15,7,16],[8,15,8,16],[9,18,9,19],[8,18,8,19],[7,18,7,19]]}
[]
[null,null,null,null,null,null,null,"CANTON  NORD"]
[]
[]
[]
[]
[]
[null,null,null,null,null,null,null,null,null,null,null,null,null,null,null,{"$f":"Candidats!A2","v":"Bertrand"},null,null,{"$f":"Candidats!A3","v":"Marc"},null,null,{"$f":"Candidats!A4","v":"Étienne"},null,null,{"$f":"Candidats!A5","v":"Bastien"},null,null,{"$f":"Candidats!A6","v":"Christophe"},null,null,{"$f":"Candidats!A7","v":"Jean-Marie"},null,null,{"$f":"Candidats!A8","v":"Damien"}]
[null,null,null,"BUREAUX",null,null,"Inscrits",null,"Votants",null,"Particip.","Nuls",null,"Exprimés",null,{"$f":"Candidats!B2","v":"CHEVALIER"},null,"%",{"$f":"Candidats!B3","v":"ARCHAMBAULT"},null,"%",{"$f":"Candidats!B4","v":"BUTZBACH"},null,"%",{"$f":"Candidats!B5","v":"FAUDOT"},null,"%",{"$f":"Candidats!B6","v":"GRUDLER"},null,"%",{"$f":"Candidats!B7","v":"PHEULPIN"},null,"%",{"$f":"Candidats!B8","v":"MESLOT"},null,"%"]
[]
[]
[null,"E1","-","Raymond Aubert","N",null,{"$f":"IF('E1'!$E7=\"\",\"\",'E1'!$E7)","v":1181},null,{"$f":"IF('E1'!$E9=\"\",\"\",'E1'!$E9)","v":668},null,{"$f":"IF(I12=\"\",\" \",I12/$G12)","v":0.56562235393734128},{"$f":"IF('E1'!$E10=\"\",\"\",'E1'!$E10)","v":19},null,{"$f":"IF('E1'!$E11=\"\",\"\",'E1'!$E11)","v":649},null,{"$f":"IF('E1'!$E12=\"\",\"\",'E1'!$E12)","v":23},null,{"$f":"IF(P12=\"\",\" \",P12/$N12)","v":3.543913713405239E-2},{"$f":"IF('E1'!$E13=\"\",\"\",'E1'!$E13)","v":96},null,{"$f":"IF(S12=\"\",\" \",S12/$N12)","v":0.14791987673343607},{"$f":"IF('E1'!$E14=\"\",\"\",'E1'!$E14)","v":88},null,{"$f":"IF(V12=\"\",\" \",V12/$N12)","v":0.13559322033898305},{"$f":"IF('E1'!$E15=\"\",\"\",'E1'!$E15)","v":88},null,{"$f":"IF(Y12=\"\",\" \",Y12/$N12)","v":0.13559322033898305},{"$f":"IF('E1'!$E16=\"\",\"\",'E1'!$E16)","v":92},null,{"$f":"IF(AB12=\"\",\" \",AB12/$N12)","v":0.14175654853620956},{"$f":"IF('E1'!$E17=\"\",\"\",'E1'!$E17)","v":18},null,{"$f":"IF(AE12=\"\",\" \",AE12/$N12)","v":2.7734976887519261E-2},{"$f":"IF('E1'!$E18=\"\",\"\",'E1'!$E18)","v":244},null,{"$f":"IF(AH12=\"\",\" \",AH12/$N12)","v":0.37596302003081666}]
[null,"E2","-","Raymond Aubert","N",null,{"$f":"IF('E2'!$E7=\"\",\"\",'E2'!$E7)","v":1212},null,{"$f":"IF('E2'!$E9=\"\",\"\",'E2'!$E9)","v":681},null,{"$f":"IF(I13=\"\",\" \",I13/$G13)","v":0.56188118811881194},{"$f":"IF('E2'!$E10=\"\",\"\",'E2'!$E10)","v":28},null,{"$f":"IF('E2'!$E11=\"\",\"\",'E2'!$E11)","v":653},null,{"$f":"IF('E2'!$E12=\"\",\"\",'E2'!$E12)","v":18},null,{"$f":"IF(P13=\"\",\" \",P13/$N13)","v":2.7565084226646247E-2},{"$f":"IF('E2'!$E13=\"\",\"\",'E2'!$E13)","v":115},null,{"$f":"IF(S13=\"\",\" \",S13/$N13)","v":0.17611026033690658},{"$f":"IF('E2'!$E14=\"\",\"\",'E2'!$E14)","v":122},null,{"$f":"IF(V13=\"\",\" \",V13/$N13)","v":0.18683001531393567},{"$f":"IF('E2'!$E15=\"\",\"\",'E2'!$E15)","v":51},null,{"$f":"IF(Y13=\"\",\" \",Y13/$N13)","v":7.8101071975497705E-2},{"$f":"IF('E2'!$E16=\"\",\"\",'E2'!$E16)","v":92},null,{"$f":"IF(AB13=\"\",\" \",AB13/$N13)","v":0.14088820826952528},{"$f":"IF('E2'!$E17=\"\",\"\",'E2'!$E17)","v":14},null,{"$f":"IF(AE13=\"\",\" \",AE13/$N13)","v":2.1439509954058193E-2},{"$f":"IF('E2'!$E18=\"\",\"\",'E2'!$E18)","v":241},null,{"$f":"IF(AH13=\"\",\" \",AH13/$N13)","v":0.36906584992343033}]
[null,"E3","-","Raymond Aubert","N",null,{"$f":"IF('E3'!$E7=\"\",\"\",'E3'!$E7)","v":1038},null,{"$f":"IF('E3'!$E9=\"\",\"\",'E3'!$E9)","v":564},null,{"$f":"IF(I14=\"\",\" \",I14/$G14)","v":0.54335260115606931},{"$f":"IF('E3'!$E10=\"\",\"\",'E3'!$E10)","v":24},null,{"$f":"IF('E3'!$E11=\"\",\"\",'E3'!$E11)","v":540},null,{"$f":"IF('E3'!$E12=\"\",\"\",'E3'!$E12)","v":21},null,{"$f":"IF(P14=\"\",\" \",P14/$N14)","v":3.888888888888889E-2},{"$f":"IF('E3'!$E13=\"\",\"\",'E3'!$E13)","v":94},null,{"$f":"IF(S14=\"\",\" \",S14/$N14)","v":0.17407407407407408},{"$f":"IF('E3'!$E14=\"\",\"\",'E3'!$E14)","v":121},null,{"$f":"IF(V14=\"\",\" \",V14/$N14)","v":0.22407407407407406},{"$f":"IF('E3'!$E15=\"\",\"\",'E3'!$E15)","v":60},null,{"$f":"IF(Y14=\"\",\" \",Y14/$N14)","v":0.1111111111111111},{"$f":"IF('E3'!$E16=\"\",\"\",'E3'!$E16)","v":61},null,{"$f":"IF(AB14=\"\",\" \",AB14/$N14)","v":0.11296296296296296},{"$f":"IF('E3'!$E17=\"\",\"\",'E3'!$E17)","v":16},null,{"$f":"IF(AE14=\"\",\" \",AE14/$N14)","v":2.9629629629629631E-2},{"$f":"IF('E3'!$E18=\"\",\"\",'E3'!$E18)","v":167},null,{"$f":"IF(AH14=\"\",\" \",AH14/$N14)","v":0.30925925925925923}]
[null,"F1","-","Maison de l'enfant","N",null,{"$f":"IF('F1'!$E7=\"\",\"\",'F1'!$E7)","v":776},null,{"$f":"IF('F1'!$E9=\"\",\"\",'F1'!$E9)","v":459},null,{"$f":"IF(I15=\"\",\" \",I15/$G15)","v":0.59149484536082475},{"$f":"IF('F1'!$E10=\"\",\"\",'F1'!$E10)","v":18},null,{"$f":"IF('F1'!$E11=\"\",\"\",'F1'!$E11)","v":441},null,{"$f":"IF('F1'!$E12=\"\",\"\",'F1'!$E12)","v":29},null,{"$f":"IF(P15=\"\",\" \",P15/$N15)","v":6.5759637188208611E-2},{"$f":"IF('F1'!$E13=\"\",\"\",'F1'!$E13)","v":57},null,{"$f":"IF(S15=\"\",\" \",S15/$N15)","v":0.12925170068027211},{"$f":"IF('F1'!$E14=\"\",\"\",'F1'!$E14)","v":106},null,{"$f":"IF(V15=\"\",\" \",V15/$N15)","v":0.24036281179138322},{"$f":"IF('F1'!$E15=\"\",\"\",'F1'!$E15)","v":31},null,{"$f":"IF(Y15=\"\",\" \",Y15/$N15)","v":7.029478458049887E-2},{"$f":"IF('F1'!$E16=\"\",\"\",'F1'!$E16)","v":94},null,{"$f":"IF(AB15=\"\",\" \",AB15/$N15)","v":0.21315192743764172},{"$f":"IF('F1'!$E17=\"\",\"\",'F1'!$E17)","v":9},null,{"$f":"IF(AE15=\"\",\" \",AE15/$N15)","v":2.0408163265306121E-2},{"$f":"IF('F1'!$E18=\"\",\"\",'F1'!$E18)","v":115},null,{"$f":"IF(AH15=\"\",\" \",AH15/$N15)","v":0.26077097505668934}]
[null,"F2","-","Émile Géhant","N",null,{"$f":"IF('F2'!$E7=\"\",\"\",'F2'!$E7)","v":522},null,{"$f":"IF('F2'!$E9=\"\",\"\",'F2'!$E9)","v":299},null,{"$f":"IF(I16=\"\",\" \",I16/$G16)","v":0.57279693486590033},{"$f":"IF('F2'!$E10=\"\",\"\",'F2'!$E10)","v":13},null,{"$f":"IF('F2'!$E11=\"\",\"\",'F2'!$E11)","v":286},null,{"$f":"IF('F2'!$E12=\"\",\"\",'F2'!$E12)","v":27},null,{"$f":"IF(P16=\"\",\" \",P16/$N16)","v":9.4405594405594401E-2},{"$f":"IF('F2'!$E13=\"\",\"\",'F2'!$E13)","v":53},null,{"$f":"IF(S16=\"\",\" \",S16/$N16)","v":0.18531468531468531},{"$f":"IF('F2'!$E14=\"\",\"\",'F2'!$E14)","v":49},null,{"$f":"IF(V16=\"\",\" \",V16/$N16)","v":0.17132867132867133},{"$f":"IF('F2'!$E15=\"\",\"\",'F2'!$E15)","v":34},null,{"$f":"IF(Y16=\"\",\" \",Y16/$N16)","v":0.11888111888111888},{"$f":"IF('F2'!$E16=\"\",\"\",'F2'!$E16)","v":40},null,{"$f":"IF(AB16=\"\",\" \",AB16/$N16)","v":0.13986013986013987},{"$f":"IF('F2'!$E17=\"\",\"\",'F2'!$E17)","v":24},null,{"$f":"IF(AE16=\"\",\" \",AE16/$N16)","v":8.3916083916083919E-2},{"$f":"IF('F2'!$E18=\"\",\"\",'F2'!$E18)","v":59},null,{"$f":"IF(AH16=\"\",\" \",AH16/$N16)","v":0.2062937062937063}]
[]
[null,"Total Canton NORD",null,null,null,null,{"$f":"SUM(G$12:G$16)","v":4729},null,{"$f":"SUM(I12:I16)","v":2671},null,{"$f":"IF(I18=\"\",\" \",I18/$G18)","v":0.56481285684076976},{"$f":"SUM(L12:L16)","v":102},null,{"$f":"SUM(N12:N16)","v":2569},null,{"$f":"SUM(P12:P16)","v":118},null,{"$f":"IF(P18=0,\" \",P18/$N18)","v":4.5932269365511876E-2},{"$f":"SUM(S12:S16)","v":415},null,{"$f":"IF(S18=0,\" \",S18/$N18)","v":0.16154145581938498},{"$f":"SUM(V12:V16)","v":486},null,{"$f":"IF(V18=0,\" \",V18/$N18)","v":0.18917866874270145},{"$f":"SUM(Y12:Y16)","v":264},null,{"$f":"IF(Y18=0,\" \",Y18/$N18)","v":0.10276372129233165},{"$f":"SUM(AB12:AB16)","v":379},null,{"$f":"IF(AB18=0,\" \",AB18/$N18)","v":0.14752822109770339},{"$f":"SUM(AE12:AE16)","v":81},null,{"$f":"IF(AE18=0,\" \",AE18/$N18)","v":3.1529778123783575E-2},{"$f":"SUM(AH12:AH16)","v":826},null,{"$f":"IF(AH18=0,\" \",AH18/$N18)","v":0.32152588555858308}]
[]
[]
[null,"%  par rapport aux VOTANTS",null,null,null,null,null,null,null,null,null,{"$f":"IF(L18=0,\" \",L18/$I18)","v":3.8187944590041184E-2},null,{"$f":"IF(N18=0,\" \",N18/$I18)","v":0.96181205540995884}]
[null,"%  par rapport aux INSCRITS",null,null,null,null,null,null,null,null,null,{"$f":"IF(L18=0,\" \",L18/$G18)","v":2.1569042080778176E-2},null,{"$f":"IF(N18=0,\" \",N18/$G18)","v":0.54324381475999151},null,{"$f":"IF(P18=0,\" \",P18/$G18)","v":2.4952421230704167E-2},null,null,{"$f":"IF(S18=0,\" \",S18/$G18)","v":8.775639670120533E-2},null,null,{"$f":"IF(V18=0,\" \",V18/$G18)","v":0.10277014167900191},null,null,{"$f":"IF(Y18=0,\" \",Y18/$G18)","v":5.5825755973778812E-2},null,null,{"$f":"IF(AB18=0,\" \",AB18/$G18)","v":8.0143793613871861E-2},null,null,{"$f":"IF(AE18=0,\" \",AE18/$G18)","v":1.7128356946500316E-2},null,null,{"$f":"IF(AH18=0,\" \",AH18/$G18)","v":0.17466694861492915}]

{"sheet":"SUD","index":31,"n_rows":23,"n_cols":36,"rows_kept":23,"cut":false,"hidden":false,"merged":[[9,30,9,31],[9,33,9,34],[7,30,7,31],[7,33,7,34],[8,30,8,31],[8,33,8,34],[7,27,7,28],[8,27,8,28],[9,27,9,28],[7,21,7,22],[8,21,8,22],[9,21,9,22],[9,24,9,25],[9,15,9,16],[8,24,8,25],[7,24,7,25],[1,7,1,14],[7,15,7,16],[8,15,8,16],[9,18,9,19],[8,18,8,19],[7,18,7,19]]}
[]
[null,null,null,null,null,null,null,"CANTON  SUD"]
[]
[]
[]
[]
[]
[null,null,null,null,null,null,null,null,null,null,null,null,null,null,null,{"$f":"Candidats!A2","v":"Bertrand"},null,null,{"$f":"Candidats!A3","v":"Marc"},null,null,{"$f":"Candidats!A4","v":"Étienne"},null,null,{"$f":"Candidats!A5","v":"Bastien"},null,null,{"$f":"Candidats!A6","v":"Christophe"},null,null,{"$f":"Candidats!A7","v":"Jean-Marie"},null,null,{"$f":"Candidats!A8","v":"Damien"}]
[null,null,null,"BUREAUX",null,null,"Inscrits",null,"Votants",null,"Particip.","Nuls",null,"Exprimés",null,{"$f":"Candidats!B2","v":"CHEVALIER"},null,"%",{"$f":"Candidats!B3","v":"ARCHAMBAULT"},null,"%",{"$f":"Candidats!B4","v":"BUTZBACH"},null,"%",{"$f":"Candidats!B5","v":"FAUDOT"},null,"%",{"$f":"Candidats!B6","v":"GRUDLER"},null,"%",{"$f":"Candidats!B7","v":"PHEULPIN"},null,"%",{"$f":"Candidats!B8","v":"MESLOT"},null,"%"]
[]
[]
[null,"G1","-","Hubert Metzger","S",null,{"$f":"IF('G1'!$E7=\"\",\"\",'G1'!$E7)","v":653},null,{"$f":"IF('G1'!$E9=\"\",\"\",'G1'!$E9)","v":414},null,{"$f":"IF(I12=\"\",\" \",I12/$G12)","v":0.63399693721286365},{"$f":"IF('G1'!$E10=\"\",\"\",'G1'!$E10)","v":18},null,{"$f":"IF('G1'!$E11=\"\",\"\",'G1'!$E11)","v":396},null,{"$f":"IF('G1'!$E12=\"\",\"\",'G1'!$E12)","v":36},null,{"$f":"IF(P12=\"\",\" \",P12/$N12)","v":9.0909090909090912E-2},{"$f":"IF('G1'!$E13=\"\",\"\",'G1'!$E13)","v":54},null,{"$f":"IF(S12=\"\",\" \",S12/$N12)","v":0.13636363636363635},{"$f":"IF('G1'!$E14=\"\",\"\",'G1'!$E14)","v":97},null,{"$f":"IF(V12=\"\",\" \",V12/$N12)","v":0.24494949494949494},{"$f":"IF('G1'!$E15=\"\",\"\",'G1'!$E15)","v":33},null,{"$f":"IF(Y12=\"\",\" \",Y12/$N12)","v":8.3333333333333329E-2},{"$f":"IF('G1'!$E16=\"\",\"\",'G1'!$E16)","v":68},null,{"$f":"IF(AB12=\"\",\" \",AB12/$N12)","v":0.17171717171717171},{"$f":"IF('G1'!$E17=\"\",\"\",'G1'!$E17)","v":9},null,{"$f":"IF(AE12=\"\",\" \",AE12/$N12)","v":2.2727272727272728E-2},{"$f":"IF('G1'!$E18=\"\",\"\",'G1'!$E18)","v":99},null,{"$f":"IF(AH12=\"\",\" \",AH12/$N12)","v":0.25}]
[null,"G2","-","Hubert Metzger","S",null,{"$f":"IF('G2'!$E7=\"\",\"\",'G2'!$E7)","v":755},null,{"$f":"IF('G2'!$E9=\"\",\"\",'G2'!$E9)","v":419},null,0.55496688741721856,{"$f":"IF('G2'!$E10=\"\",\"\",'G2'!$E10)","v":15},null,{"$f":"IF('G2'!$E11=\"\",\"\",'G2'!$E11)","v":404},null,{"$f":"IF('G2'!$E12=\"\",\"\",'G2'!$E12)","v":59},null,0.14603960396039603,{"$f":"IF('G2'!$E13=\"\",\"\",'G2'!$E13)","v":64},null,0.15841584158415842,{"$f":"IF('G2'!$E14=\"\",\"\",'G2'!$E14)","v":97},null,0.24009900990099009,{"$f":"IF('G2'!$E15=\"\",\"\",'G2'!$E15)","v":31},null,7.6732673267326731E-2,{"$f":"IF('G2'!$E16=\"\",\"\",'G2'!$E16)","v":50},null,0.12376237623762376,{"$f":"IF('G2'!$E17=\"\",\"\",'G2'!$E17)","v":6},null,1.4851485148514851E-2,{"$f":"IF('G2'!$E18=\"\",\"\",'G2'!$E18)","v":97},null,0.24009900990099009]
[null,"H1","-","Léonard de Vinci","S",null,{"$f":"IF('H1'!$E7=\"\",\"\",'H1'!$E7)","v":1042},null,{"$f":"IF('H1'!$E9=\"\",\"\",'H1'!$E9)","v":574},null,0.55086372360844527,{"$f":"IF('H1'!$E10=\"\",\"\",'H1'!$E10)","v":26},null,{"$f":"IF('H1'!$E11=\"\",\"\",'H1'!$E11)","v":548},null,{"$f":"IF('H1'!$E12=\"\",\"\",'H1'!$E12)","v":29},null,5.2919708029197078E-2,{"$f":"IF('H1'!$E13=\"\",\"\",'H1'!$E13)","v":64},null,0.11678832116788321,{"$f":"IF('H1'!$E14=\"\",\"\",'H1'!$E14)","v":133},null,0.24270072992700731,{"$f":"IF('H1'!$E15=\"\",\"\",'H1'!$E15)","v":61},null,0.11131386861313869,{"$f":"IF('H1'!$E16=\"\",\"\",'H1'!$E16)","v":64},null,0.11678832116788321,{"$f":"IF('H1'!$E17=\"\",\"\",'H1'!$E17)","v":15},null,2.7372262773722629E-2,{"$f":"IF('H1'!$E18=\"\",\"\",'H1'!$E18)","v":182},null,0.33211678832116787]
[null,"J1","-","René Rucklin","S",null,{"$f":"IF('J1'!$E7=\"\",\"\",'J1'!$E7)","v":597},null,{"$f":"IF('J1'!$E9=\"\",\"\",'J1'!$E9)","v":266},null,0.44556113902847572,{"$f":"IF('J1'!$E10=\"\",\"\",'J1'!$E10)","v":9},null,{"$f":"IF('J1'!$E11=\"\",\"\",'J1'!$E11)","v":257},null,{"$f":"IF('J1'!$E12=\"\",\"\",'J1'!$E12)","v":7},null,2.7237354085603113E-2,{"$f":"IF('J1'!$E13=\"\",\"\",'J1'!$E13)","v":50},null,0.19455252918287938,{"$f":"IF('J1'!$E14=\"\",\"\",'J1'!$E14)","v":63},null,0.24513618677042801,{"$f":"IF('J1'!$E15=\"\",\"\",'J1'!$E15)","v":28},null,0.10894941634241245,{"$f":"IF('J1'!$E16=\"\",\"\",'J1'!$E16)","v":43},null,0.16731517509727625,{"$f":"IF('J1'!$E17=\"\",\"\",'J1'!$E17)","v":3},null,1.1673151750972763E-2,{"$f":"IF('J1'!$E18=\"\",\"\",'J1'!$E18)","v":63},null,0.24513618677042801]
[null,"J2","-","René Rucklin","S",null,{"$f":"IF('J2'!$E7=\"\",\"\",'J2'!$E7)","v":818},null,{"$f":"IF('J2'!$E9=\"\",\"\",'J2'!$E9)","v":438},null,0.53545232273838628,{"$f":"IF('J2'!$E10=\"\",\"\",'J2'!$E10)","v":14},null,{"$f":"IF('J2'!$E11=\"\",\"\",'J2'!$E11)","v":424},null,{"$f":"IF('J2'!$E12=\"\",\"\",'J2'!$E12)","v":8},null,1.8867924528301886E-2,{"$f":"IF('J2'!$E13=\"\",\"\",'J2'!$E13)","v":42},null,9.9056603773584911E-2,{"$f":"IF('J2'!$E14=\"\",\"\",'J2'!$E14)","v":102},null,0.24056603773584906,{"$f":"IF('J2'!$E15=\"\",\"\",'J2'!$E15)","v":43},null,0.10141509433962265,{"$f":"IF('J2'!$E16=\"\",\"\",'J2'!$E16)","v":79},null,0.18632075471698112,{"$f":"IF('J2'!$E17=\"\",\"\",'J2'!$E17)","v":13},null,3.0660377358490566E-2,{"$f":"IF('J2'!$E18=\"\",\"\",'J2'!$E18)","v":137},null,0.32311320754716982]
[null,"J3","-","René Rucklin","S",null,{"$f":"IF('J3'!$E7=\"\",\"\",'J3'!$E7)","v":562},null,{"$f":"IF('J3'!$E9=\"\",\"\",'J3'!$E9)","v":277},null,0.49288256227758009,{"$f":"IF('J3'!$E10=\"\",\"\",'J3'!$E10)","v":20},null,{"$f":"IF('J3'!$E11=\"\",\"\",'J3'!$E11)","v":257},null,{"$f":"IF('J3'!$E12=\"\",\"\",'J3'!$E12)","v":17},null,6.6147859922178989E-2,{"$f":"IF('J3'!$E13=\"\",\"\",'J3'!$E13)","v":26},null,0.10116731517509728,{"$f":"IF('J3'!$E14=\"\",\"\",'J3'!$E14)","v":88},null,0.34241245136186771,{"$f":"IF('J3'!$E15=\"\",\"\",'J3'!$E15)","v":35},null,0.13618677042801555,{"$f":"IF('J3'!$E16=\"\",\"\",'J3'!$E16)","v":29},null,0.11284046692607004,{"$f":"IF('J3'!$E17=\"\",\"\",'J3'!$E17)","v":2},null,7.7821011673151752E-3,{"$f":"IF('J3'!$E18=\"\",\"\",'J3'!$E18)","v":60},null,0.23346303501945526]
[]
[null,"Total Canton SUD",null,null,null,null,{"$f":"SUM(G$12:G$17)","v":4427},null,{"$f":"SUM(I12:I17)","v":2388},null,{"$f":"IF(I19=\"\",\" \",I19/$G19)","v":0.5394172125592952},{"$f":"SUM(L12:L17)","v":102},null,{"$f":"SUM(N12:N17)","v":2286},null,{"$f":"SUM(P12:P17)","v":156},null,{"$f":"IF(P19=0,\" \",P19/$N19)","v":6.8241469816272965E-2},{"$f":"SUM(S12:S17)","v":300},null,{"$f":"IF(S19=0,\" \",S19/$N19)","v":0.13123359580052493},{"$f":"SUM(V12:V17)","v":580},null,{"$f":"IF(V19=0,\" \",V19/$N19)","v":0.25371828521434819},{"$f":"SUM(Y12:Y17)","v":231},null,{"$f":"IF(Y19=0,\" \",Y19/$N19)","v":0.10104986876640421},{"$f":"SUM(AB12:AB17)","v":333},null,{"$f":"IF(AB19=0,\" \",AB19/$N19)","v":0.14566929133858267},{"$f":"SUM(AE12:AE17)","v":48},null,{"$f":"IF(AE19=0,\" \",AE19/$N19)","v":2.0997375328083989E-2},{"$f":"SUM(AH12:AH17)","v":638},null,{"$f":"IF(AH19=0,\" \",AH19/$N19)","v":0.27909011373578302}]
[]
[]
[null,"%  par rapport aux VOTANTS",null,null,null,null,null,null,null,null,null,{"$f":"IF(L19=0,\" \",L19/$I19)","v":4.2713567839195977E-2},null,{"$f":"IF(N19=0,\" \",N19/$I19)","v":0.957286432160804}]
[null,"%  par rapport aux INSCRITS",null,null,null,null,null,null,null,null,null,{"$f":"IF(L19=0,\" \",L19/$G19)","v":2.3040433702281454E-2},null,{"$f":"IF(N19=0,\" \",N19/$G19)","v":0.51637677885701383},null,{"$f":"IF(P19=0,\" \",P19/$G19)","v":3.5238310368195164E-2},null,null,{"$f":"IF(S19=0,\" \",S19/$G19)","v":6.7765981477298398E-2},null,null,{"$f":"IF(V19=0,\" \",V19/$G19)","v":0.13101423085611022},null,null,{"$f":"IF(Y19=0,\" \",Y19/$G19)","v":5.2179805737519763E-2},null,null,{"$f":"IF(AB19=0,\" \",AB19/$G19)","v":7.5220239439801218E-2},null,null,{"$f":"IF(AE19=0,\" \",AE19/$G19)","v":1.0842557036367743E-2},null,null,{"$f":"IF(AH19=0,\" \",AH19/$G19)","v":0.14411565394172127}]

{"sheet":"OUEST","index":32,"n_rows":21,"n_cols":36,"rows_kept":21,"cut":false,"hidden":false,"merged":[[9,30,9,31],[9,33,9,34],[7,30,7,31],[7,33,7,34],[8,30,8,31],[8,33,8,34],[9,27,9,28],[8,27,8,28],[7,27,7,28],[9,21,9,22],[8,21,8,22],[7,21,7,22],[7,24,7,25],[8,24,8,25],[9,24,9,25],[9,18,9,19],[8,18,8,19],[7,18,7,19],[1,7,1,14],[7,15,7,16],[8,15,8,16],[9,15,9,16]]}
[]
[null,null,null,null,null,null,null,"CANTON  OUEST"]
[]
[]
[]
[]
[]
[null,null,null,null,null,null,null,null,null,null,null,null,null,null,null,{"$f":"Candidats!A2","v":"Bertrand"},null,null,{"$f":"Candidats!A3","v":"Marc"},null,null,{"$f":"Candidats!A4","v":"Étienne"},null,null,{"$f":"Candidats!A5","v":"Bastien"},null,null,{"$f":"Candidats!A6","v":"Christophe"},null,null,{"$f":"Candidats!A7","v":"Jean-Marie"},null,null,{"$f":"Candidats!A8","v":"Damien"}]
[null,null,null,"BUREAUX",null,null,"Inscrits",null,"Votants",null,"Particip.","Nuls",null,"Exprimés",null,{"$f":"Candidats!B2","v":"CHEVALIER"},null,"%",{"$f":"Candidats!B3","v":"ARCHAMBAULT"},null,"%",{"$f":"Candidats!B4","v":"BUTZBACH"},null,"%",{"$f":"Candidats!B5","v":"FAUDOT"},null,"%",{"$f":"Candidats!B6","v":"GRUDLER"},null,"%",{"$f":"Candidats!B7","v":"PHEULPIN"},null,"%",{"$f":"Candidats!B8","v":"MESLOT"},null,"%"]
[]
[]
[null,"K1","-","Louis Pergaud","O",null,{"$f":"IF('K1'!$E7=\"\",\"\",'K1'!$E7)","v":959},null,{"$f":"IF('K1'!$E9=\"\",\"\",'K1'!$E9)","v":487},null,{"$f":"IF(I12=\"\",\" \",I12/$G12)","v":0.50782064650677794},{"$f":"IF('K1'!$E10=\"\",\"\",'K1'!$E10)","v":18},null,{"$f":"IF('K1'!$E11=\"\",\"\",'K1'!$E11)","v":469},null,{"$f":"IF('K1'!$E12=\"\",\"\",'K1'!$E12)","v":11},null,{"$f":"IF(P12=\"\",\" \",P12/$N12)","v":2.3454157782515993E-2},{"$f":"IF('K1'!$E13=\"\",\"\",'K1'!$E13)","v":53},null,{"$f":"IF(S12=\"\",\" \",S12/$N12)","v":0.11300639658848614},{"$f":"IF('K1'!$E14=\"\",\"\",'K1'!$E14)","v":153},null,{"$f":"IF(V12=\"\",\" \",V12/$N12)","v":0.32622601279317698},{"$f":"IF('K1'!$E15=\"\",\"\",'K1'!$E15)","v":39},null,{"$f":"IF(Y12=\"\",\" \",Y12/$N12)","v":8.3155650319829424E-2},{"$f":"IF('K1'!$E16=\"\",\"\",'K1'!$E16)","v":30},null,{"$f":"IF(AB12=\"\",\" \",AB12/$N12)","v":6.3965884861407252E-2},{"$f":"IF('K1'!$E17=\"\",\"\",'K1'!$E17)","v":10},null,{"$f":"IF(AE12=\"\",\" \",AE12/$N12)","v":2.1321961620469083E-2},{"$f":"IF('K1'!$E18=\"\",\"\",'K1'!$E18)","v":173},null,{"$f":"IF(AH12=\"\",\" \",AH12/$N12)","v":0.36886993603411516}]
[null,"K2","-","Louis Pergaud","O",null,{"$f":"IF('K2'!$E7=\"\",\"\",'K2'!$E7)","v":789},null,{"$f":"IF('K2'!$E9=\"\",\"\",'K2'!$E9)","v":395},null,{"$f":"IF(I13=\"\",\" \",I13/$G13)","v":0.50063371356147024},{"$f":"IF('K2'!$E10=\"\",\"\",'K2'!$E10)","v":12},null,{"$f":"IF('K2'!$E11=\"\",\"\",'K2'!$E11)","v":383},null,{"$f":"IF('K2'!$E12=\"\",\"\",'K2'!$E12)","v":9},null,{"$f":"IF(P13=\"\",\" \",P13/$N13)","v":2.3498694516971279E-2},{"$f":"IF('K2'!$E13=\"\",\"\",'K2'!$E13)","v":46},null,{"$f":"IF(S13=\"\",\" \",S13/$N13)","v":0.12010443864229765},{"$f":"IF('K2'!$E14=\"\",\"\",'K2'!$E14)","v":128},null,{"$f":"IF(V13=\"\",\" \",V13/$N13)","v":0.33420365535248042},{"$f":"IF('K2'!$E15=\"\",\"\",'K2'!$E15)","v":30},null,{"$f":"IF(Y13=\"\",\" \",Y13/$N13)","v":7.8328981723237601E-2},{"$f":"IF('K2'!$E16=\"\",\"\",'K2'!$E16)","v":28},null,{"$f":"IF(AB13=\"\",\" \",AB13/$N13)","v":7.3107049608355096E-2},{"$f":"IF('K2'!$E17=\"\",\"\",'K2'!$E17)","v":9},null,{"$f":"IF(AE13=\"\",\" \",AE13/$N13)","v":2.3498694516971279E-2},{"$f":"IF('K2'!$E18=\"\",\"\",'K2'!$E18)","v":133},null,{"$f":"IF(AH13=\"\",\" \",AH13/$N13)","v":0.3472584856396867}]
[null,"L1","-","Les Barres - Maternelle","O",null,{"$f":"IF('L1'!$E7=\"\",\"\",'L1'!$E7)","v":1336},null,{"$f":"IF('L1'!$E9=\"\",\"\",'L1'!$E9)","v":759},null,{"$f":"IF(I14=\"\",\" \",I14/$G14)","v":0.56811377245508987},{"$f":"IF('L1'!$E10=\"\",\"\",'L1'!$E10)","v":19},null,{"$f":"IF('L1'!$E11=\"\",\"\",'L1'!$E11)","v":740},null,{"$f":"IF('L1'!$E12=\"\",\"\",'L1'!$E12)","v":34},null,{"$f":"IF(P14=\"\",\" \",P14/$N14)","v":4.5945945945945948E-2},{"$f":"IF('L1'!$E13=\"\",\"\",'L1'!$E13)","v":108},null,{"$f":"IF(S14=\"\",\" \",S14/$N14)","v":0.14594594594594595},{"$f":"IF('L1'!$E14=\"\",\"\",'L1'!$E14)","v":143},null,{"$f":"IF(V14=\"\",\" \",V14/$N14)","v":0.19324324324324324},{"$f":"IF('L1'!$E15=\"\",\"\",'L1'!$E15)","v":132},null,{"$f":"IF(Y14=\"\",\" \",Y14/$N14)","v":0.17837837837837839},{"$f":"IF('L1'!$E16=\"\",\"\",'L1'!$E16)","v":97},null,{"$f":"IF(AB14=\"\",\" \",AB14/$N14)","v":0.13108108108108107},{"$f":"IF('L1'!$E17=\"\",\"\",'L1'!$E17)","v":16},null,{"$f":"IF(AE14=\"\",\" \",AE14/$N14)","v":2.1621621621621623E-2},{"$f":"IF('L1'!$E18=\"\",\"\",'L1'!$E18)","v":210},null,{"$f":"IF(AH14=\"\",\" \",AH14/$N14)","v":0.28378378378378377}]
[null,"L2","-","Les Barres - Primaire","O",null,{"$f":"IF('L2'!$E7=\"\",\"\",'L2'!$E7)","v":1155},null,{"$f":"IF('L2'!$E9=\"\",\"\",'L2'!$E9)","v":709},null,{"$f":"IF(I15=\"\",\" \",I15/$G15)","v":0.61385281385281387},{"$f":"IF('L2'!$E10=\"\",\"\",'L2'!$E10)","v":35},null,{"$f":"IF('L2'!$E11=\"\",\"\",'L2'!$E11)","v":674},null,{"$f":"IF('L2'!$E12=\"\",\"\",'L2'!$E12)","v":47},null,{"$f":"IF(P15=\"\",\" \",P15/$N15)","v":6.9732937685459948E-2},{"$f":"IF('L2'!$E13=\"\",\"\",'L2'!$E13)","v":103},null,{"$f":"IF(S15=\"\",\" \",S15/$N15)","v":0.15281899109792285},{"$f":"IF('L2'!$E14=\"\",\"\",'L2'!$E14)","v":148},null,{"$f":"IF(V15=\"\",\" \",V15/$N15)","v":0.21958456973293769},{"$f":"IF('L2'!$E15=\"\",\"\",'L2'!$E15)","v":86},null,{"$f":"IF(Y15=\"\",\" \",Y15/$N15)","v":0.12759643916913946},{"$f":"IF('L2'!$E16=\"\",\"\",'L2'!$E16)","v":102},null,{"$f":"IF(AB15=\"\",\" \",AB15/$N15)","v":0.1513353115727003},{"$f":"IF('L2'!$E17=\"\",\"\",'L2'!$E17)","v":18},null,{"$f":"IF(AE15=\"\",\" \",AE15/$N15)","v":2.6706231454005934E-2},{"$f":"IF('L2'!$E18=\"\",\"\",'L2'!$E18)","v":170},null,{"$f":"IF(AH15=\"\",\" \",AH15/$N15)","v":0.25222551928783382}]
[]
[null,"Total Canton OUEST",null,null,null,null,{"$f":"SUM(G$12:G$15)","v":4239},null,{"$f":"SUM(I12:I15)","v":2350},null,{"$f":"IF(I17=\"\",\" \",I17/$G17)","v":0.55437603208303843},{"$f":"SUM(L12:L15)","v":84},null,{"$f":"SUM(N12:N15)","v":2266},null,{"$f":"SUM(P12:P15)","v":101},null,{"$f":"IF(P17=0,\" \",P17/$N17)","v":4.4571932921447482E-2},{"$f":"SUM(S12:S15)","v":310},null,{"$f":"IF(S17=0,\" \",S17/$N17)","v":0.13680494263018536},{"$f":"SUM(V12:V15)","v":572},null,{"$f":"IF(V17=0,\" \",V17/$N17)","v":0.25242718446601942},{"$f":"SUM(Y12:Y15)","v":287},null,{"$f":"IF(Y17=0,\" \",Y17/$N17)","v":0.12665489849955869},{"$f":"SUM(AB12:AB15)","v":257},null,{"$f":"IF(AB17=0,\" \",AB17/$N17)","v":0.11341571050308914},{"$f":"SUM(AE12:AE15)","v":53},null,{"$f":"IF(AE17=0,\" \",AE17/$N17)","v":2.3389232127096204E-2},{"$f":"SUM(AH12:AH15)","v":686},null,{"$f":"IF(AH17=0,\" \",AH17/$N17)","v":0.30273609885260372}]
[]
[]
[null,"%  par rapport aux VOTANTS",null,null,null,null,null,null,null,null,null,{"$f":"IF(L17=0,\" \",L17/$I17)","v":3.5744680851063831E-2},null,{"$f":"IF(N17=0,\" \",N17/$I17)","v":0.96425531914893614}]
[null,"%  par rapport aux INSCRITS",null,null,null,null,null,null,null,null,null,{"$f":"IF(L17=0,\" \",L17/$G17)","v":1.9815994338287332E-2},null,{"$f":"IF(N17=0,\" \",N17/$G17)","v":0.53456003774475114},null,{"$f":"IF(P17=0,\" \",P17/$G17)","v":2.3826374144845484E-2},null,null,{"$f":"IF(S17=0,\" \",S17/$G17)","v":7.3130455296060395E-2},null,null,{"$f":"IF(V17=0,\" \",V17/$G17)","v":0.13493748525595659},null,null,{"$f":"IF(Y17=0,\" \",Y17/$G17)","v":6.7704647322481715E-2},null,null,{"$f":"IF(AB17=0,\" \",AB17/$G17)","v":6.06275064873791E-2},null,null,{"$f":"IF(AE17=0,\" \",AE17/$G17)","v":1.2502948808681292E-2},null,null,{"$f":"IF(AH17=0,\" \",AH17/$G17)","v":0.16183062042934654}]

{"sheet":"RESULTATS","index":33,"n_rows":50,"n_cols":41,"rows_kept":50,"cut":false,"hidden":false,"merged":[[49,32,49,34],[49,23,49,25],[49,20,49,22],[49,26,49,28],[49,29,49,31],[18,1,18,3],[25,1,25,3],[31,1,31,3],[49,0,49,3],[38,1,38,3],[43,1,43,3],[8,16,8,17],[8,32,9,33],[7,20,7,21],[7,23,7,24],[7,26,7,27],[7,29,7,30],[7,32,7,33],[8,20,9,21],[8,23,9,24],[8,26,9,27],[8,18,8,19],[8,29,9,30],[7,38,7,39],[8,38,9,39],[49,38,49,40],[7,35,7,36],[8,35,9,36],[49,35,49,37]]}
[]
[null,null,null,null,null,null,"RÉSULTATS  du  1er  Tour",null,null,null,null,null,null,null,null,null,null,null,null,null,null,null,null,{"$f":"COUNTIF($I$12:$I$18,\">0\")+COUNTIF($I$20:$I$25,\">0\")+COUNTIF($I$27:$I$31,\">0\")+COUNTIF($I$33:$I$38,\">0\")+COUNTIF($I$40:$I$43,\">0\")","v":28},null,null,"Bureaux sur",null,28]
[]
[]
[null,null,null,null,null,null,null,null,null,null,null,null,null,null,null,null,null,null,null,null,null,null,null,{"$f":"SUMIF($I$12:$I$18,\">0\",$E$12:$E$18)+SUMIF($I$20:$I$25,\">0\",$E$20:$E$25)+SUMIF($I$27:$I$31,\">0\",$E$27:$E$31)+SUMIF($I$33:$I$38,\">0\",$E$33:$E$38)+SUMIF($I$40:$I$43,\">0\",$E$40:$E$43)","v":26948},null,null,"Inscrits sur",null,{"$f":"$E$47","v":26948},null,"soit",":",{"$f":"$X$5/$AC$5","v":1}]
[]
[]
[null,null,null,null,null,null,null,null,null,null,null,null,null,null,null,null,null,null,"%  /",null,{"$f":"Candidats!A2","v":"Bertrand"},null,null,{"$f":"Candidats!A3","v":"Marc"},null,null,{"$f":"Candidats!A4","v":"Étienne"},null,null,{"$f":"Candidats!A5","v":"Bastien"},null,null,{"$f":"Candidats!A6","v":"Christophe"},null,null,{"$f":"Candidats!A7","v":"Jean-Marie"},null,null,{"$f":"Candidats!A8","v":"Damien"}]
[null,null,null,"BUREAUX","Inscrits",null,"Emargements",null,"Votants",null,"Abstentions",null,"Participation",null,"Nuls",null,"Exprimés",null,"Inscrits",null,{"$f":"Candidats!B2","v":"CHEVALIER"},null,"%",{"$f":"Candidats!B3","v":"ARCHAMBAULT"},null,"%",{"$f":"Candidats!B4","v":"BUTZBACH"},null,"%",{"$f":"Candidats!B5","v":"FAUDOT"},null,"%",{"$f":"Candidats!B6","v":"GRUDLER"},null,"%",{"$f":"Candidats!B7","v":"PHEULPIN"},null,"%",{"$f":"Candidats!B8","v":"MESLOT"},null,"%"]
[]
[]
[null,"A1  -   Hôtel de Ville",null,null,{"$f":"IF('A1'!$E7=\"\",\"\",'A1'!$E7)","v":949},null,{"$f":"IF('A1'!$E8=\"\",\"\",'A1'!$E8)","v":508},null,{"$f":"IF('A1'!$E9=\"\",\"\",'A1'!$E9)","v":508},null,{"$f":"IF(G12<>\"\",E12-I12,\"\")","v":441},null,{"$f":"IF(I12=\"\",\" \",I12/$E12)","v":0.53530031612223394},null,{"$f":"IF('A1'!$E10=\"\",\"\",'A1'!$E10)","v":12},null,{"$f":"IF('A1'!$E11=\"\",\"\",'A1'!$E11)","v":496},null,{"$f":"IF(Q12=\"\",\" \",Q12/$E12)","v":0.52265542676501575},null,{"$f":"IF('A1'!$E12=\"\",\"\",'A1'!$E12)","v":20},null,{"$f":"IF(U12=\"\",\"\",U12/$Q12)","v":4.0322580645161289E-2},{"$f":"IF('A1'!$E13=\"\",\"\",'A1'!$E13)","v":32},null,{"$f":"IF(X12=\"\",\"\",X12/$Q12)","v":6.4516129032258063E-2},{"$f":"IF('A1'!$E14=\"\",\"\",'A1'!$E14)","v":104},null,{"$f":"IF(AA12=\"\",\"\",AA12/$Q12)","v":0.20967741935483872},{"$f":"IF('A1'!$E15=\"\",\"\",'A1'!$E15)","v":60},null,{"$f":"IF(AD12=\"\",\"\",AD12/$Q12)","v":0.12096774193548387},{"$f":"IF('A1'!$E18=\"\",\"\",'A1'!$E16)","v":105},null,{"$f":"IF(AG12=\"\",\"\",AG12/$Q12)","v":0.21169354838709678},{"$f":"IF('A1'!$E18=\"\",\"\",'A1'!$E17)","v":8},null,{"$f":"IF(AJ12=\"\",\"\",AJ12/$Q12)","v":1.6129032258064516E-2},{"$f":"IF('A1'!$E18=\"\",\"\",'A1'!$E18)","v":167},null,{"$f":"IF(AM12=\"\",\"\",AM12/$Q12)","v":0.33669354838709675}]
[null,"A2  -  Salle des fêtes",null,null,{"$f":"IF('A2'!$E7=\"\",\"\",'A2'!$E7)","v":956},null,{"$f":"IF('A2'!$E8=\"\",\"\",'A2'!$E8)","v":610},null,{"$f":"IF('A2'!$E9=\"\",\"\",'A2'!$E9)","v":610},null,{"$f":"IF(G13<>\"\",E13-I13,\"\")","v":346},null,{"$f":"IF(I13=\"\",\" \",I13/$E13)","v":0.63807531380753135},null,{"$f":"IF('A2'!$E10=\"\",\"\",'A2'!$E10)","v":18},null,{"$f":"IF('A2'!$E11=\"\",\"\",'A2'!$E11)","v":592},null,{"$f":"IF(Q13=\"\",\" \",Q13/$E13)","v":0.61924686192468614},null,{"$f":"IF('A2'!$E12=\"\",\"\",'A2'!$E12)","v":29},null,4.8986486486486486E-2,{"$f":"IF('A2'!$E13=\"\",\"\",'A2'!$E13)","v":42},null,7.0945945945945943E-2,{"$f":"IF('A2'!$E14=\"\",\"\",'A2'!$E14)","v":107},null,0.18074324324324326,{"$f":"IF('A2'!$E15=\"\",\"\",'A2'!$E15)","v":69},null,0.11655405405405406,{"$f":"IF('A2'!E16=\"\",\"\",'A2'!E16)","v":105},null,0.17736486486486486,{"$f":"IF('A2'!E17=\"\",\"\",'A2'!E17)","v":7},null,1.1824324324324325E-2,{"$f":"IF('A2'!E18=\"\",\"\",'A2'!E18)","v":233},null,0.39358108108108109]
[null,"B1  -  Victor Hugo",null,null,{"$f":"IF('B1'!$E7=\"\",\"\",'B1'!$E7)","v":1096},null,{"$f":"IF('B1'!$E8=\"\",\"\",'B1'!$E8)","v":623},null,{"$f":"IF('B1'!$E9=\"\",\"\",'B1'!$E9)","v":622},null,{"$f":"IF(G14<>\"\",E14-I14,\"\")","v":474},null,0.56751824817518248,null,{"$f":"IF('B1'!$E10=\"\",\"\",'B1'!$E10)","v":11},null,{"$f":"IF('B1'!$E11=\"\",\"\",'B1'!$E11)","v":611},null,0.55748175182481752,null,{"$f":"IF('B1'!$E12=\"\",\"\",'B1'!$E12)","v":26},null,4.2553191489361701E-2,{"$f":"IF('B1'!$E13=\"\",\"\",'B1'!$E13)","v":46},null,7.5286415711947621E-2,{"$f":"IF('B1'!$E14=\"\",\"\",'B1'!$E14)","v":132},null,0.2160392798690671,{"$f":"IF('B1'!$E15=\"\",\"\",'B1'!$E15)","v":71},null,0.11620294599018004,{"$f":"IF('B1'!E16=\"\",\"\",'B1'!E16)","v":115},null,0.18821603927986907,{"$f":"IF('B1'!E17=\"\",\"\",'B1'!E17)","v":9},null,1.4729950900163666E-2,{"$f":"IF('B1'!E18=\"\",\"\",'B1'!E18)","v":212},null,0.34697217675941078]
[null,"B2  -  Victor Hugo",null,null,{"$f":"IF('B2'!$E7=\"\",\"\",'B2'!$E7)","v":1167},null,{"$f":"IF('B2'!$E8=\"\",\"\",'B2'!$E8)","v":715},null,{"$f":"IF('B2'!$E9=\"\",\"\",'B2'!$E9)","v":715},null,452,null,0.61268209083119107,null,{"$f":"IF('B2'!$E10=\"\",\"\",'B2'!$E10)","v":15},null,{"$f":"IF('B2'!$E11=\"\",\"\",'B2'!$E11)","v":700},null,0.59982862039417306,null,{"$f":"IF('B2'!$E12=\"\",\"\",'B2'!$E12)","v":37},null,5.2857142857142859E-2,{"$f":"IF('B2'!$E13=\"\",\"\",'B2'!$E13)","v":57},null,8.1428571428571433E-2,{"$f":"IF('B2'!$E14=\"\",\"\",'B2'!$E14)","v":126},null,0.18,{"$f":"IF('B2'!$E15=\"\",\"\",'B2'!$E15)","v":87},null,0.12428571428571429,{"$f":"IF('B2'!E16=\"\",\"\",'B2'!E16)","v":126},null,0.18,{"$f":"IF('B2'!E17=\"\",\"\",'B2'!E17)","v":12},null,1.7142857142857144E-2,{"$f":"IF('B2'!E18=\"\",\"\",'B2'!E18)","v":255},null,0.36428571428571427]
[null,"M1  -  Saint-Exupéry",null,null,{"$f":"IF('M1'!$E7=\"\",\"\",'M1'!$E7)","v":1306},null,{"$f":"IF('M1'!$E8=\"\",\"\",'M1'!$E8)","v":599},null,{"$f":"IF('M1'!$E9=\"\",\"\",'M1'!$E9)","v":599},null,707,null,0.45865237366003064,null,{"$f":"IF('M1'!$E10=\"\",\"\",'M1'!$E10)","v":18},null,{"$f":"IF('M1'!$E11=\"\",\"\",'M1'!$E11)","v":581},null,0.44486983154670751,null,{"$f":"IF('M1'!$E12=\"\",\"\",'M1'!$E12)","v":23},null,3.9586919104991396E-2,{"$f":"IF('M1'!$E13=\"\",\"\",'M1'!$E13)","v":50},null,8.6058519793459548E-2,{"$f":"IF('M1'!$E14=\"\",\"\",'M1'!$E14)","v":215},null,0.37005163511187605,{"$f":"IF('M1'!$E15=\"\",\"\",'M1'!$E15)","v":50},null,8.6058519793459548E-2,{"$f":"IF('M1'!E16=\"\",\"\",'M1'!E16)","v":112},null,0.19277108433734941,{"$f":"IF('M1'!E17=\"\",\"\",'M1'!E17)","v":8},null,1.3769363166953529E-2,{"$f":"IF('M1'!E18=\"\",\"\",'M1'!E18)","v":123},null,0.2117039586919105]
[null,"N1  -  Jean Moulin",null,null,{"$f":"IF('N1'!$E7=\"\",\"\",'N1'!$E7)","v":1456},null,{"$f":"IF('N1'!$E8=\"\",\"\",'N1'!$E8)","v":825},null,{"$f":"IF('N1'!$E9=\"\",\"\",'N1'!$E9)","v":825},null,631,null,0.56662087912087911,null,{"$f":"IF('N1'!$E10=\"\",\"\",'N1'!$E10)","v":17},null,{"$f":"IF('N1'!$E11=\"\",\"\",'N1'!$E11)","v":808},null,0.55494505494505497,null,{"$f":"IF('N1'!$E12=\"\",\"\",'N1'!$E12)","v":32},null,3.9603960396039604E-2,{"$f":"IF('N1'!$E13=\"\",\"\",'N1'!$E13)","v":111},null,0.13737623762376239,{"$f":"IF('N1'!$E14=\"\",\"\",'N1'!$E14)","v":150},null,0.18564356435643564,{"$f":"IF('N1'!$E15=\"\",\"\",'N1'!$E15)","v":78},null,9.6534653465346537E-2,{"$f":"IF('N1'!E16=\"\",\"\",'N1'!E16)","v":176},null,0.21782178217821782,{"$f":"IF('N1'!E17=\"\",\"\",'N1'!E17)","v":12},null,1.4851485148514851E-2,{"$f":"IF('N1'!E18=\"\",\"\",'N1'!E18)","v":249},null,0.30816831683168316]
[null,"N2  -  Cité des Associations",null,null,{"$f":"IF('N2'!$E7=\"\",\"\",'N2'!$E7)","v":905},null,{"$f":"IF('N2'!$E8=\"\",\"\",'N2'!$E8)","v":577},null,{"$f":"IF('N2'!$E9=\"\",\"\",'N2'!$E9)","v":577},null,328,null,0.63756906077348063,null,{"$f":"IF('N2'!$E10=\"\",\"\",'N2'!$E10)","v":11},null,{"$f":"IF('N2'!$E11=\"\",\"\",'N2'!$E11)","v":566},null,0.62541436464088396,null,{"$f":"IF('N2'!$E12=\"\",\"\",'N2'!$E12)","v":25},null,4.4169611307420496E-2,{"$f":"IF('N2'!$E13=\"\",\"\",'N2'!$E13)","v":44},null,7.7738515901060068E-2,{"$f":"IF('N2'!$E14=\"\",\"\",'N2'!$E14)","v":113},null,0.19964664310954064,{"$f":"IF('N2'!$E15=\"\",\"\",'N2'!$E15)","v":67},null,0.11837455830388692,{"$f":"IF('N2'!E16=\"\",\"\",'N2'!E16)","v":167},null,0.29505300353356889,{"$f":"IF('N2'!E17=\"\",\"\",'N2'!E17)","v":5},null,8.8339222614840993E-3,{"$f":"IF('N2'!E18=\"\",\"\",'N2'!E18)","v":145},null,0.25618374558303886]
[null,"Canton EST",null,null,{"$f":"SUM(E$12:E$18)","v":7835},null,{"$f":"SUM(G12:G18)","v":4457},null,{"$f":"SUM(I12:I18)","v":4456},null,3379,null,0.56873005743458838,null,{"$f":"SUM(O12:O18)","v":102},null,{"$f":"SUM(Q12:Q18)","v":4354},null,0.55571155073388645,null,{"$f":"SUM(U12:U18)","v":192},null,{"$f":"IF(U19=0,\"\",U19/$Q19)","v":4.4097381717960495E-2},{"$f":"SUM(X12:X18)","v":382},null,{"$f":"IF(X19=0,\"\",X19/$Q19)","v":8.7735415709692233E-2},{"$f":"SUM(AA12:AA18)","v":947},null,{"$f":"IF(AA19=0,\"\",AA19/$Q19)","v":0.21750114836931558},{"$f":"SUM(AD12:AD18)","v":482},null,{"$f":"IF(AD19=0,\"\",AD19/$Q19)","v":0.11070280202112999},{"$f":"SUM(AG12:AG18)","v":906},null,{"$f":"IF(AG19=0,\"\",AG19/$Q19)","v":0.20808451998162608},{"$f":"SUM(AJ12:AJ18)","v":61},null,{"$f":"IF(AJ19=0,\"\",AJ19/$Q19)","v":1.4010105649977032E-2},{"$f":"SUM(AM12:AM18)","v":1384},null,{"$f":"IF(AM19=0,\"\",AM19/$Q19)","v":0.31786862655029857}]
[null,"C1  -  Victor Schoelcher",null,null,{"$f":"IF('C1'!$E7=\"\",\"\",'C1'!$E7)","v":1210},null,{"$f":"IF('C1'!$E8=\"\",\"\",'C1'!$E8)","v":719},null,{"$f":"IF('C1'!$E9=\"\",\"\",'C1'!$E9)","v":719},null,491,null,0.59421487603305789,null,{"$f":"IF('C1'!$E10=\"\",\"\",'C1'!$E10)","v":17},null,{"$f":"IF('C1'!$E11=\"\",\"\",'C1'!$E11)","v":702},null,0.58016528925619837,null,{"$f":"IF('C1'!$E12=\"\",\"\",'C1'!$E12)","v":24},null,{"$f":"IF(U20=\"\",\"\",U20/$Q20)","v":3.4188034188034191E-2},{"$f":"IF('C1'!$E13=\"\",\"\",'C1'!$E13)","v":65},null,{"$f":"IF(X20=\"\",\"\",X20/$Q20)","v":9.2592592592592587E-2},{"$f":"IF('C1'!$E14=\"\",\"\",'C1'!$E14)","v":153},null,{"$f":"IF(AA20=\"\",\"\",AA20/$Q20)","v":0.21794871794871795},{"$f":"IF('C1'!$E15=\"\",\"\",'C1'!$E15)","v":89},null,{"$f":"IF(AD20=\"\",\"\",AD20/$Q20)","v":0.12678062678062679},{"$f":"IF('C1'!E16=\"\",\"\",'C1'!E16)","v":92},null,{"$f":"IF(AG20=\"\",\"\",AG20/$Q20)","v":0.13105413105413105},{"$f":"IF('C1'!E17=\"\",\"\",'C1'!E17)","v":9},null,{"$f":"IF(AJ20=\"\",\"\",AJ20/$Q20)","v":1.282051282051282E-2},{"$f":"IF('C1'!E18=\"\",\"\",'C1'!E18)","v":270},null,{"$f":"IF(AM20=\"\",\"\",AM20/$Q20)","v":0.38461538461538464}]
[null,"C2  -  Maison du Peuple",null,null,{"$f":"IF('C2'!$E7=\"\",\"\",'C2'!$E7)","v":763},null,{"$f":"IF('C2'!$E8=\"\",\"\",'C2'!$E8)","v":474},null,{"$f":"IF('C2'!$E9=\"\",\"\",'C2'!$E9)","v":474},null,289,null,0.62123197903014415,null,{"$f":"IF('C2'!$E10=\"\",\"\",'C2'!$E10)","v":11},null,{"$f":"IF('C2'!$E11=\"\",\"\",'C2'!$E11)","v":463},null,0.60681520314547832,null,{"$f":"IF('C2'!$E12=\"\",\"\",'C2'!$E12)","v":23},null,4.9676025917926567E-2,{"$f":"IF('C2'!$E13=\"\",\"\",'C2'!$E13)","v":43},null,9.2872570194384454E-2,{"$f":"IF('C2'!$E14=\"\",\"\",'C2'!$E14)","v":82},null,0.17710583153347731,{"$f":"IF('C2'!$E15=\"\",\"\",'C2'!$E15)","v":54},null,0.11663066954643629,{"$f":"IF('C2'!E16=\"\",\"\",'C2'!E16)","v":58},null,0.12526997840172785,{"$f":"IF('C2'!E17=\"\",\"\",'C2'!E17)","v":5},null,1.079913606911447E-2,{"$f":"IF('C2'!E18=\"\",\"\",'C2'!E18)","v":198},null,0.42764578833693306]
[null,"C3  -  Maison du Peuple",null,null,{"$f":"IF('C3'!$E7=\"\",\"\",'C3'!$E7)","v":921},null,{"$f":"IF('C3'!$E8=\"\",\"\",'C3'!$E8)","v":564},null,{"$f":"IF('C3'!$E9=\"\",\"\",'C3'!$E9)","v":564},null,357,null,0.6123778501628665,null,{"$f":"IF('C3'!$E10=\"\",\"\",'C3'!$E10)","v":12},null,{"$f":"IF('C3'!$E11=\"\",\"\",'C3'!$E11)","v":552},null,0.59934853420195444,null,{"$f":"IF('C3'!$E12=\"\",\"\",'C3'!$E12)","v":19},null,3.4420289855072464E-2,{"$f":"IF('C3'!$E13=\"\",\"\",'C3'!$E13)","v":48},null,8.6956521739130432E-2,{"$f":"IF('C3'!$E14=\"\",\"\",'C3'!$E14)","v":105},null,0.19021739130434784,{"$f":"IF('C3'!$E15=\"\",\"\",'C3'!$E15)","v":56},null,0.10144927536231885,{"$f":"IF('C3'!E16=\"\",\"\",'C3'!E16)","v":62},null,0.11231884057971014,{"$f":"IF('C3'!E17=\"\",\"\",'C3'!E17)","v":6},null,1.0869565217391304E-2,{"$f":"IF('C3'!E18=\"\",\"\",'C3'!E18)","v":256},null,0.46376811594202899]
[null,"D1  -  Châteaudun",null,null,{"$f":"IF('D1'!$E7=\"\",\"\",'D1'!$E7)","v":1074},null,{"$f":"IF('D1'!$E8=\"\",\"\",'D1'!$E8)","v":613},null,{"$f":"IF('D1'!$E9=\"\",\"\",'D1'!$E9)","v":613},null,461,null,0.57076350093109873,null,{"$f":"IF('D1'!$E10=\"\",\"\",'D1'!$E10)","v":17},null,{"$f":"IF('D1'!$E11=\"\",\"\",'D1'!$E11)","v":596},null,0.55493482309124764,null,{"$f":"IF('D1'!$E12=\"\",\"\",'D1'!$E12)","v":14},null,2.3489932885906041E-2,{"$f":"IF('D1'!$E13=\"\",\"\",'D1'!$E13)","v":70},null,0.1174496644295302,{"$f":"IF('D1'!$E14=\"\",\"\",'D1'!$E14)","v":103},null,0.17281879194630873,{"$f":"IF('D1'!$E15=\"\",\"\",'D1'!$E15)","v":51},null,8.557046979865772E-2,{"$f":"IF('D1'!E16=\"\",\"\",'D1'!E16)","v":80},null,0.13422818791946309,{"$f":"IF('D1'!E17=\"\",\"\",'D1'!E17)","v":7},null,1.1744966442953021E-2,{"$f":"IF('D1'!E18=\"\",\"\",'D1'!E18)","v":271},null,0.45469798657718119]
[null,"D2  -  Châteaudun",null,null,{"$f":"IF('D2'!$E7=\"\",\"\",'D2'!$E7)","v":838},null,{"$f":"IF('D2'!$E8=\"\",\"\",'D2'!$E8)","v":503},null,{"$f":"IF('D2'!$E9=\"\",\"\",'D2'!$E9)","v":503},null,335,null,0.60023866348448685,null,{"$f":"IF('D2'!$E10=\"\",\"\",'D2'!$E10)","v":22},null,{"$f":"IF('D2'!$E11=\"\",\"\",'D2'!$E11)","v":481},null,0.57398568019093077,null,{"$f":"IF('D2'!$E12=\"\",\"\",'D2'!$E12)","v":20},null,4.1580041580041582E-2,{"$f":"IF('D2'!$E13=\"\",\"\",'D2'!$E13)","v":56},null,0.11642411642411643,{"$f":"IF('D2'!$E14=\"\",\"\",'D2'!$E14)","v":67},null,0.1392931392931393,{"$f":"IF('D2'!$E15=\"\",\"\",'D2'!$E15)","v":56},null,0.11642411642411643,{"$f":"IF('D2'!E16=\"\",\"\",'D2'!E16)","v":78},null,0.16216216216216217,{"$f":"IF('D2'!E17=\"\",\"\",'D2'!E17)","v":7},null,1.4553014553014554E-2,{"$f":"IF('D2'!E18=\"\",\"\",'D2'!E18)","v":197},null,0.40956340956340959]
[null,"D3  -  Châteaudun",null,null,{"$f":"IF('D3'!$E7=\"\",\"\",'D3'!$E7)","v":912},null,{"$f":"IF('D3'!$E8=\"\",\"\",'D3'!$E8)","v":554},null,{"$f":"IF('D3'!$E9=\"\",\"\",'D3'!$E9)","v":554},null,358,null,0.60745614035087714,null,{"$f":"IF('D3'!$E10=\"\",\"\",'D3'!$E10)","v":18},null,{"$f":"IF('D3'!$E11=\"\",\"\",'D3'!$E11)","v":536},null,0.58771929824561409,null,{"$f":"IF('D3'!$E12=\"\",\"\",'D3'!$E12)","v":37},null,6.9029850746268662E-2,{"$f":"IF('D3'!$E13=\"\",\"\",'D3'!$E13)","v":91},null,0.16977611940298507,{"$f":"IF('D3'!$E14=\"\",\"\",'D3'!$E14)","v":70},null,0.13059701492537312,{"$f":"IF('D3'!$E15=\"\",\"\",'D3'!$E15)","v":47},null,8.7686567164179108E-2,{"$f":"IF('D3'!E16=\"\",\"\",'D3'!E16)","v":76},null,0.1417910447761194,{"$f":"IF('D3'!E17=\"\",\"\",'D3'!E17)","v":16},null,2.9850746268656716E-2,{"$f":"IF('D3'!E18=\"\",\"\",'D3'!E18)","v":199},null,0.3712686567164179]
[null,"Canton CENTRE",null,null,{"$f":"SUM(E$20:E$25)","v":5718},null,{"$f":"SUM(G20:G25)","v":3427},null,{"$f":"SUM(I20:I25)","v":3427},null,2291,null,0.59933543196922001,null,{"$f":"SUM(O20:O25)","v":97},null,{"$f":"SUM(Q20:Q25)","v":3330},null,0.58237145855194128,null,{"$f":"SUM(U20:U25)","v":137},null,{"$f":"IF(U26=0,\"\",U26/$Q26)","v":4.114114114114114E-2},{"$f":"SUM(X20:X25)","v":373},null,{"$f":"IF(X26=0,\"\",X26/$Q26)","v":0.11201201201201201},{"$f":"SUM(AA20:AA25)","v":580},null,{"$f":"IF(AA26=0,\"\",AA26/$Q26)","v":0.17417417417417416},{"$f":"SUM(AD20:AD25)","v":353},null,{"$f":"IF(AD26=0,\"\",AD26/$Q26)","v":0.106006006006006},{"$f":"SUM(AG20:AG25)","v":446},null,{"$f":"IF(AG26=0,\"\",AG26/$Q26)","v":0.13393393393393394},{"$f":"SUM(AJ20:AJ25)","v":50},null,{"$f":"IF(AJ26=0,\"\",AJ26/$Q26)","v":1.5015015015015015E-2},{"$f":"SUM(AM20:AM25)","v":1391},null,{"$f":"IF(AM26=0,\"\",AM26/$Q26)","v":0.41771771771771771}]
[null,"E1  -  Raymond Aubert",null,null,{"$f":"IF('E1'!E$7=\"\",\"\",'E1'!E$7)","v":1181},null,{"$f":"IF('E1'!$E8=\"\",\"\",'E1'!$E8)","v":668},null,{"$f":"IF('E1'!$E9=\"\",\"\",'E1'!$E9)","v":668},null,513,null,0.56562235393734128,null,{"$f":"IF('E1'!$E10=\"\",\"\",'E1'!$E10)","v":19},null,{"$f":"IF('E1'!$E11=\"\",\"\",'E1'!$E11)","v":649},null,0.54953429297205758,null,{"$f":"IF('E1'!$E12=\"\",\"\",'E1'!$E12)","v":23},null,{"$f":"IF(U27=\"\",\"\",U27/$Q27)","v":3.543913713405239E-2},{"$f":"IF('E1'!$E13=\"\",\"\",'E1'!$E13)","v":96},null,{"$f":"IF(X27=\"\",\"\",X27/$Q27)","v":0.14791987673343607},{"$f":"IF('E1'!$E14=\"\",\"\",'E1'!$E14)","v":88},null,{"$f":"IF(AA27=\"\",\"\",AA27/$Q27)","v":0.13559322033898305},{"$f":"IF('E1'!$E15=\"\",\"\",'E1'!$E15)","v":88},null,{"$f":"IF(AD27=\"\",\"\",AD27/$Q27)","v":0.13559322033898305},{"$f":"IF('E1'!E16=\"\",\"\",'E1'!E16)","v":92},null,{"$f":"IF(AG27=\"\",\"\",AG27/$Q27)","v":0.14175654853620956},{"$f":"IF('E1'!E17=\"\",\"\",'E1'!E17)","v":18},null,{"$f":"IF(AJ27=\"\",\"\",AJ27/$Q27)","v":2.7734976887519261E-2},{"$f":"IF('E1'!E18=\"\",\"\",'E1'!E18)","v":244},null,{"$f":"IF(AM27=\"\",\"\",AM27/$Q27)","v":0.37596302003081666}]
[null,"E2  -  Raymond Aubert",null,null,{"$f":"IF('E2'!$E7=\"\",\"\",'E2'!$E7)","v":1212},null,{"$f":"IF('E2'!$E8=\"\",\"\",'E2'!$E8)","v":680},null,{"$f":"IF('E2'!$E9=\"\",\"\",'E2'!$E9)","v":681},null,531,null,0.56188118811881194,null,{"$f":"IF('E2'!$E10=\"\",\"\",'E2'!$E10)","v":28},null,{"$f":"IF('E2'!$E11=\"\",\"\",'E2'!$E11)","v":653},null,0.53877887788778878,null,{"$f":"IF('E2'!$E12=\"\",\"\",'E2'!$E12)","v":18},null,{"$f":"IF(U28=\"\",\"\",U28/$Q28)","v":2.7565084226646247E-2},{"$f":"IF('E2'!$E13=\"\",\"\",'E2'!$E13)","v":115},null,{"$f":"IF(X28=\"\",\"\",X28/$Q28)","v":0.17611026033690658},{"$f":"IF('E2'!$E14=\"\",\"\",'E2'!$E14)","v":122},null,{"$f":"IF(AA28=\"\",\"\",AA28/$Q28)","v":0.18683001531393567},{"$f":"IF('E2'!$E15=\"\",\"\",'E2'!$E15)","v":51},null,{"$f":"IF(AD28=\"\",\"\",AD28/$Q28)","v":7.8101071975497705E-2},{"$f":"IF('E2'!E16=\"\",\"\",'E2'!E16)","v":92},null,{"$f":"IF(AG28=\"\",\"\",AG28/$Q28)","v":0.14088820826952528},{"$f":"IF('E2'!E17=\"\",\"\",'E2'!E17)","v":14},null,{"$f":"IF(AJ28=\"\",\"\",AJ28/$Q28)","v":2.1439509954058193E-2},{"$f":"IF('E2'!E18=\"\",\"\",'E2'!E18)","v":241},null,{"$f":"IF(AM28=\"\",\"\",AM28/$Q28)","v":0.36906584992343033}]
[null,"E3  -  Raymond Aubert",null,null,{"$f":"IF('E3'!$E7=\"\",\"\",'E3'!$E7)","v":1038},null,{"$f":"IF('E3'!$E8=\"\",\"\",'E3'!$E8)","v":564},null,{"$f":"IF('E3'!$E9=\"\",\"\",'E3'!$E9)","v":564},null,474,null,0.54335260115606931,null,{"$f":"IF('E3'!$E10=\"\",\"\",'E3'!$E10)","v":24},null,{"$f":"IF('E3'!$E11=\"\",\"\",'E3'!$E11)","v":540},null,0.52023121387283233,null,{"$f":"IF('E3'!$E12=\"\",\"\",'E3'!$E12)","v":21},null,{"$f":"IF(U29=\"\",\"\",U29/$Q29)","v":3.888888888888889E-2},{"$f":"IF('E3'!$E13=\"\",\"\",'E3'!$E13)","v":94},null,{"$f":"IF(X29=\"\",\"\",X29/$Q29)","v":0.17407407407407408},{"$f":"IF('E3'!$E14=\"\",\"\",'E3'!$E14)","v":121},null,{"$f":"IF(AA29=\"\",\"\",AA29/$Q29)","v":0.22407407407407406},{"$f":"IF('E3'!$E15=\"\",\"\",'E3'!$E15)","v":60},null,{"$f":"IF(AD29=\"\",\"\",AD29/$Q29)","v":0.1111111111111111},{"$f":"IF('E3'!E16=\"\",\"\",'E3'!E16)","v":61},null,{"$f":"IF(AG29=\"\",\"\",AG29/$Q29)","v":0.11296296296296296},{"$f":"IF('E3'!E17=\"\",\"\",'E3'!E17)","v":16},null,{"$f":"IF(AJ29=\"\",\"\",AJ29/$Q29)","v":2.9629629629629631E-2},{"$f":"IF('E3'!E18=\"\",\"\",'E3'!E18)","v":167},null,{"$f":"IF(AM29=\"\",\"\",AM29/$Q29)","v":0.30925925925925923}]
[null,"F1  -  Maison de l'enfant",null,null,{"$f":"IF('F1'!$E7=\"\",\"\",'F1'!$E7)","v":776},null,{"$f":"IF('F1'!$E8=\"\",\"\",'F1'!$E8)","v":459},null,{"$f":"IF('F1'!$E9=\"\",\"\",'F1'!$E9)","v":459},null,317,null,0.59149484536082475,null,{"$f":"IF('F1'!$E10=\"\",\"\",'F1'!$E10)","v":18},null,{"$f":"IF('F1'!$E11=\"\",\"\",'F1'!$E11)","v":441},null,0.56829896907216493,null,{"$f":"IF('F1'!$E12=\"\",\"\",'F1'!$E12)","v":29},null,{"$f":"IF(U30=\"\",\"\",U30/$Q30)","v":6.5759637188208611E-2},{"$f":"IF('F1'!$E13=\"\",\"\",'F1'!$E13)","v":57},null,{"$f":"IF(X30=\"\",\"\",X30/$Q30)","v":0.12925170068027211},{"$f":"IF('F1'!$E14=\"\",\"\",'F1'!$E14)","v":106},null,{"$f":"IF(AA30=\"\",\"\",AA30/$Q30)","v":0.24036281179138322},{"$f":"IF('F1'!$E15=\"\",\"\",'F1'!$E15)","v":31},null,{"$f":"IF(AD30=\"\",\"\",AD30/$Q30)","v":7.029478458049887E-2},{"$f":"IF('F1'!E16=\"\",\"\",'F1'!E16)","v":94},null,{"$f":"IF(AG30=\"\",\"\",AG30/$Q30)","v":0.21315192743764172},{"$f":"IF('F1'!E17=\"\",\"\",'F1'!E17)","v":9},null,{"$f":"IF(AJ30=\"\",\"\",AJ30/$Q30)","v":2.0408163265306121E-2},{"$f":"IF('F1'!E18=\"\",\"\",'F1'!E18)","v":115},null,{"$f":"IF(AM30=\"\",\"\",AM30/$Q30)","v":0.26077097505668934}]
[null,"F2  -  Émile Géhant",null,null,{"$f":"IF('F2'!$E7=\"\",\"\",'F2'!$E7)","v":522},null,{"$f":"IF('F2'!$E8=\"\",\"\",'F2'!$E8)","v":299},null,{"$f":"IF('F2'!$E9=\"\",\"\",'F2'!$E9)","v":299},null,223,null,0.57279693486590033,null,{"$f":"IF('F2'!$E10=\"\",\"\",'F2'!$E10)","v":13},null,{"$f":"IF('F2'!$E11=\"\",\"\",'F2'!$E11)","v":286},null,0.54789272030651337,null,{"$f":"IF('F2'!$E12=\"\",\"\",'F2'!$E12)","v":27},null,{"$f":"IF(U31=\"\",\"\",U31/$Q31)","v":9.4405594405594401E-2},{"$f":"IF('F2'!$E13=\"\",\"\",'F2'!$E13)","v":53},null,{"$f":"IF(X31=\"\",\"\",X31/$Q31)","v":0.18531468531468531},{"$f":"IF('F2'!$E14=\"\",\"\",'F2'!$E14)","v":49},null,{"$f":"IF(AA31=\"\",\"\",AA31/$Q31)","v":0.17132867132867133},{"$f":"IF('F2'!$E15=\"\",\"\",'F2'!$E15)","v":34},null,{"$f":"IF(AD31=\"\",\"\",AD31/$Q31)","v":0.11888111888111888},{"$f":"IF('F2'!E16=\"\",\"\",'F2'!E16)","v":40},null,{"$f":"IF(AG31=\"\",\"\",AG31/$Q31)","v":0.13986013986013987},{"$f":"IF('F2'!E17=\"\",\"\",'F2'!E17)","v":24},null,{"$f":"IF(AJ31=\"\",\"\",AJ31/$Q31)","v":8.3916083916083919E-2},{"$f":"IF('F2'!E18=\"\",\"\",'F2'!E18)","v":59},null,{"$f":"IF(AM31=\"\",\"\",AM31/$Q31)","v":0.2062937062937063}]
[null,"Canton NORD",null,null,{"$f":"SUM(E$27:E$31)","v":4729},null,{"$f":"SUM(G27:G31)","v":2670},null,{"$f":"SUM(I27:I31)","v":2671},null,2058,null,0.56481285684076976,null,{"$f":"SUM(O27:O31)","v":102},null,{"$f":"SUM(Q27:Q31)","v":2569},null,0.54324381475999151,null,{"$f":"SUM(U27:U31)","v":118},null,{"$f":"IF(U32=0,\"\",U32/$Q32)","v":4.5932269365511876E-2},{"$f":"SUM(X27:X31)","v":415},null,{"$f":"IF(X32=0,\"\",X32/$Q32)","v":0.16154145581938498},{"$f":"SUM(AA27:AA31)","v":486},null,{"$f":"IF(AA32=0,\"\",AA32/$Q32)","v":0.18917866874270145},{"$f":"SUM(AD27:AD31)","v":264},null,{"$f":"IF(AD32=0,\"\",AD32/$Q32)","v":0.10276372129233165},{"$f":"SUM(AG27:AG31)","v":379},null,{"$f":"IF(AG32=0,\"\",AG32/$Q32)","v":0.14752822109770339},{"$f":"SUM(AJ27:AJ31)","v":81},null,{"$f":"IF(AJ32=0,\"\",AJ32/$Q32)","v":3.1529778123783575E-2},{"$f":"SUM(AM27:AM31)","v":826},null,{"$f":"IF(AM32=0,\"\",AM32/$Q32)","v":0.32152588555858308}]
[null,"G1  -  Hubert Metzger",null,null,{"$f":"IF('G1'!$E7=\"\",\"\",'G1'!$E7)","v":653},null,{"$f":"IF('G1'!$E8=\"\",\"\",'G1'!$E8)","v":414},null,{"$f":"IF('G1'!$E9=\"\",\"\",'G1'!$E9)","v":414},null,239,null,0.63399693721286365,null,{"$f":"IF('G1'!$E10=\"\",\"\",'G1'!$E10)","v":18},null,{"$f":"IF('G1'!$E11=\"\",\"\",'G1'!$E11)","v":396},null,0.60643185298621749,null,{"$f":"IF('G1'!$E12=\"\",\"\",'G1'!$E12)","v":36},null,{"$f":"IF(U33=\"\",\"\",U33/$Q33)","v":9.0909090909090912E-2},{"$f":"IF('G1'!$E13=\"\",\"\",'G1'!$E13)","v":54},null,{"$f":"IF(X33=\"\",\"\",X33/$Q33)","v":0.13636363636363635},{"$f":"IF('G1'!$E14=\"\",\"\",'G1'!$E14)","v":97},null,{"$f":"IF(AA33=\"\",\"\",AA33/$Q33)","v":0.24494949494949494},{"$f":"IF('G1'!$E15=\"\",\"\",'G1'!$E15)","v":33},null,{"$f":"IF(AD33=\"\",\"\",AD33/$Q33)","v":8.3333333333333329E-2},{"$f":"IF('G1'!E16=\"\",\"\",'G1'!E16)","v":68},null,{"$f":"IF(AG33=\"\",\"\",AG33/$Q33)","v":0.17171717171717171},{"$f":"IF('G1'!E17=\"\",\"\",'G1'!E17)","v":9},null,{"$f":"IF(AJ33=\"\",\"\",AJ33/$Q33)","v":2.2727272727272728E-2},{"$f":"IF('G1'!E18=\"\",\"\",'G1'!E18)","v":99},null,{"$f":"IF(AM33=\"\",\"\",AM33/$Q33)","v":0.25}]
[null,"G2  -  Hubert Metzger",null,null,{"$f":"IF('G2'!$E7=\"\",\"\",'G2'!$E7)","v":755},null,{"$f":"IF('G2'!$E8=\"\",\"\",'G2'!$E8)","v":419},null,{"$f":"IF('G2'!$E9=\"\",\"\",'G2'!$E9)","v":419},null,336,null,0.55496688741721856,null,{"$f":"IF('G2'!$E10=\"\",\"\",'G2'!$E10)","v":15},null,{"$f":"IF('G2'!$E11=\"\",\"\",'G2'!$E11)","v":404},null,0.53509933774834439,null,{"$f":"IF('G2'!$E12=\"\",\"\",'G2'!$E12)","v":59},null,0.14603960396039603,{"$f":"IF('G2'!$E13=\"\",\"\",'G2'!$E13)","v":64},null,0.15841584158415842,{"$f":"IF('G2'!$E14=\"\",\"\",'G2'!$E14)","v":97},null,0.24009900990099009,{"$f":"IF('G2'!$E15=\"\",\"\",'G2'!$E15)","v":31},null,7.6732673267326731E-2,{"$f":"IF('G2'!E16=\"\",\"\",'G2'!E16)","v":50},null,0.12376237623762376,{"$f":"IF('G2'!E17=\"\",\"\",'G2'!E17)","v":6},null,1.4851485148514851E-2,{"$f":"IF('G2'!E18=\"\",\"\",'G2'!E18)","v":97},null,0.24009900990099009]
[null,"H1  -  Léonard de Vinci",null,null,{"$f":"IF('H1'!$E7=\"\",\"\",'H1'!$E7)","v":1042},null,{"$f":"IF('H1'!$E8=\"\",\"\",'H1'!$E8)","v":574},null,{"$f":"IF('H1'!$E9=\"\",\"\",'H1'!$E9)","v":574},null,468,null,0.55086372360844527,null,{"$f":"IF('H1'!$E10=\"\",\"\",'H1'!$E10)","v":26},null,{"$f":"IF('H1'!$E11=\"\",\"\",'H1'!$E11)","v":548},null,0.52591170825335898,null,{"$f":"IF('H1'!$E12=\"\",\"\",'H1'!$E12)","v":29},null,5.2919708029197078E-2,{"$f":"IF('H1'!$E13=\"\",\"\",'H1'!$E13)","v":64},null,0.11678832116788321,{"$f":"IF('H1'!$E14=\"\",\"\",'H1'!$E14)","v":133},null,0.24270072992700731,{"$f":"IF('H1'!$E15=\"\",\"\",'H1'!$E15)","v":61},null,0.11131386861313869,{"$f":"IF('H1'!E16=\"\",\"\",'H1'!E16)","v":64},null,0.11678832116788321,{"$f":"IF('H1'!E17=\"\",\"\",'H1'!E17)","v":15},null,2.7372262773722629E-2,{"$f":"IF('H1'!E18=\"\",\"\",'H1'!E18)","v":182},null,0.33211678832116787]
[null,"J1  -  René Rucklin",null,null,{"$f":"IF('J1'!$E7=\"\",\"\",'J1'!$E7)","v":597},null,{"$f":"IF('J1'!$E8=\"\",\"\",'J1'!$E8)","v":266},null,{"$f":"IF('J1'!$E9=\"\",\"\",'J1'!$E9)","v":266},null,331,null,0.44556113902847572,null,{"$f":"IF('J1'!$E10=\"\",\"\",'J1'!$E10)","v":9},null,{"$f":"IF('J1'!$E11=\"\",\"\",'J1'!$E11)","v":257},null,0.4304857621440536,null,{"$f":"IF('J1'!$E12=\"\",\"\",'J1'!$E12)","v":7},null,2.7237354085603113E-2,{"$f":"IF('J1'!$E13=\"\",\"\",'J1'!$E13)","v":50},null,0.19455252918287938,{"$f":"IF('J1'!$E14=\"\",\"\",'J1'!$E14)","v":63},null,0.24513618677042801,{"$f":"IF('J1'!$E15=\"\",\"\",'J1'!$E15)","v":28},null,0.10894941634241245,{"$f":"IF('J1'!E16=\"\",\"\",'J1'!E16)","v":43},null,0.16731517509727625,{"$f":"IF('J1'!E17=\"\",\"\",'J1'!E17)","v":3},null,1.1673151750972763E-2,{"$f":"IF('J1'!E18=\"\",\"\",'J1'!E18)","v":63},null,0.24513618677042801]
[null,"J2  -  René Rucklin",null,null,{"$f":"IF('J2'!$E7=\"\",\"\",'J2'!$E7)","v":818},null,{"$f":"IF('J2'!$E8=\"\",\"\",'J2'!$E8)","v":438},null,{"$f":"IF('J2'!$E9=\"\",\"\",'J2'!$E9)","v":438},null,380,null,0.53545232273838628,null,{"$f":"IF('J2'!$E10=\"\",\"\",'J2'!$E10)","v":14},null,{"$f":"IF('J2'!$E11=\"\",\"\",'J2'!$E11)","v":424},null,0.51833740831295838,null,{"$f":"IF('J2'!$E12=\"\",\"\",'J2'!$E12)","v":8},null,1.8867924528301886E-2,{"$f":"IF('J2'!$E13=\"\",\"\",'J2'!$E13)","v":42},null,9.9056603773584911E-2,{"$f":"IF('J2'!$E14=\"\",\"\",'J2'!$E14)","v":102},null,0.24056603773584906,{"$f":"IF('J2'!$E15=\"\",\"\",'J2'!$E15)","v":43},null,0.10141509433962265,{"$f":"IF('J2'!E16=\"\",\"\",'J2'!E16)","v":79},null,0.18632075471698112,{"$f":"IF('J2'!E17=\"\",\"\",'J2'!E17)","v":13},null,3.0660377358490566E-2,{"$f":"IF('J2'!E18=\"\",\"\",'J2'!E18)","v":137},null,0.32311320754716982]
[null,"J3  -  René Rucklin",null,null,{"$f":"IF('J3'!$E7=\"\",\"\",'J3'!$E7)","v":562},null,{"$f":"IF('J3'!$E8=\"\",\"\",'J3'!$E8)","v":277},null,{"$f":"IF('J3'!$E9=\"\",\"\",'J3'!$E9)","v":277},null,285,null,0.49288256227758009,null,{"$f":"IF('J3'!$E10=\"\",\"\",'J3'!$E10)","v":20},null,{"$f":"IF('J3'!$E11=\"\",\"\",'J3'!$E11)","v":257},null,0.45729537366548045,null,{"$f":"IF('J3'!$E12=\"\",\"\",'J3'!$E12)","v":17},null,6.6147859922178989E-2,{"$f":"IF('J3'!$E13=\"\",\"\",'J3'!$E13)","v":26},null,0.10116731517509728,{"$f":"IF('J3'!$E14=\"\",\"\",'J3'!$E14)","v":88},null,0.34241245136186771,{"$f":"IF('J3'!$E15=\"\",\"\",'J3'!$E15)","v":35},null,0.13618677042801555,{"$f":"IF('J3'!E16=\"\",\"\",'J3'!E16)","v":29},null,0.11284046692607004,{"$f":"IF('J3'!E17=\"\",\"\",'J3'!E17)","v":2},null,7.7821011673151752E-3,{"$f":"IF('J3'!E18=\"\",\"\",'J3'!E18)","v":60},null,0.23346303501945526]
[null,"Canton SUD",null,null,{"$f":"SUM(E$33:E$38)","v":4427},null,{"$f":"SUM(G33:G38)","v":2388},null,{"$f":"SUM(I33:I38)","v":2388},null,2039,null,0.5394172125592952,null,{"$f":"SUM(O33:O38)","v":102},null,{"$f":"SUM(Q33:Q38)","v":2286},null,0.51637677885701383,null,{"$f":"SUM(U33:U38)","v":156},null,{"$f":"IF(U39=0,\"\",U39/$Q39)","v":6.8241469816272965E-2},{"$f":"SUM(X33:X38)","v":300},null,{"$f":"IF(X39=0,\"\",X39/$Q39)","v":0.13123359580052493},{"$f":"SUM(AA33:AA38)","v":580},null,{"$f":"IF(AA39=0,\"\",AA39/$Q39)","v":0.25371828521434819},{"$f":"SUM(AD33:AD38)","v":231},null,{"$f":"IF(AD39=0,\"\",AD39/$Q39)","v":0.10104986876640421},{"$f":"SUM(AG33:AG38)","v":333},null,{"$f":"IF(AG39=0,\"\",AG39/$Q39)","v":0.14566929133858267},{"$f":"SUM(AJ33:AJ38)","v":48},null,{"$f":"IF(AJ39=0,\"\",AJ39/$Q39)","v":2.0997375328083989E-2},{"$f":"SUM(AM33:AM38)","v":638},null,{"$f":"IF(AM39=0,\"\",AM39/$Q39)","v":0.27909011373578302}]
[null,"K1  -  Louis Pergaud",null,null,{"$f":"IF('K1'!$E7=\"\",\"\",'K1'!$E7)","v":959},null,{"$f":"IF('K1'!$E8=\"\",\"\",'K1'!$E8)","v":487},null,{"$f":"IF('K1'!$E9=\"\",\"\",'K1'!$E9)","v":487},null,472,null,0.50782064650677794,null,{"$f":"IF('K1'!$E10=\"\",\"\",'K1'!$E10)","v":18},null,{"$f":"IF('K1'!$E11=\"\",\"\",'K1'!$E11)","v":469},null,0.48905109489051096,null,{"$f":"IF('K1'!$E12=\"\",\"\",'K1'!$E12)","v":11},null,{"$f":"IF(U40=\"\",\"\",U40/$Q40)","v":2.3454157782515993E-2},{"$f":"IF('K1'!$E13=\"\",\"\",'K1'!$E13)","v":53},null,{"$f":"IF(X40=\"\",\"\",X40/$Q40)","v":0.11300639658848614},{"$f":"IF('K1'!$E14=\"\",\"\",'K1'!$E14)","v":153},null,{"$f":"IF(AA40=\"\",\"\",AA40/$Q40)","v":0.32622601279317698},{"$f":"IF('K1'!$E15=\"\",\"\",'K1'!$E15)","v":39},null,{"$f":"IF(AD40=\"\",\"\",AD40/$Q40)","v":8.3155650319829424E-2},{"$f":"IF('K1'!E16=\"\",\"\",'K1'!E16)","v":30},null,{"$f":"IF(AG40=\"\",\"\",AG40/$Q40)","v":6.3965884861407252E-2},{"$f":"IF('K1'!E17=\"\",\"\",'K1'!E17)","v":10},null,{"$f":"IF(AJ40=\"\",\"\",AJ40/$Q40)","v":2.1321961620469083E-2},{"$f":"IF('K1'!E18=\"\",\"\",'K1'!E18)","v":173},null,{"$f":"IF(AM40=\"\",\"\",AM40/$Q40)","v":0.36886993603411516}]
[null,"K2  -  Louis Pergaud",null,null,{"$f":"IF('K2'!$E7=\"\",\"\",'K2'!$E7)","v":789},null,{"$f":"IF('K2'!$E8=\"\",\"\",'K2'!$E8)","v":395},null,{"$f":"IF('K2'!$E9=\"\",\"\",'K2'!$E9)","v":395},null,394,null,0.50063371356147024,null,{"$f":"IF('K2'!$E10=\"\",\"\",'K2'!$E10)","v":12},null,{"$f":"IF('K2'!$E11=\"\",\"\",'K2'!$E11)","v":383},null,0.48542458808618505,null,{"$f":"IF('K2'!$E12=\"\",\"\",'K2'!$E12)","v":9},null,{"$f":"IF(U41=\"\",\"\",U41/$Q41)","v":2.3498694516971279E-2},{"$f":"IF('K2'!$E13=\"\",\"\",'K2'!$E13)","v":46},null,{"$f":"IF(X41=\"\",\"\",X41/$Q41)","v":0.12010443864229765},{"$f":"IF('K2'!$E14=\"\",\"\",'K2'!$E14)","v":128},null,{"$f":"IF(AA41=\"\",\"\",AA41/$Q41)","v":0.33420365535248042},{"$f":"IF('K2'!$E15=\"\",\"\",'K2'!$E15)","v":30},null,{"$f":"IF(AD41=\"\",\"\",AD41/$Q41)","v":7.8328981723237601E-2},{"$f":"IF('K2'!E16=\"\",\"\",'K2'!E16)","v":28},null,{"$f":"IF(AG41=\"\",\"\",AG41/$Q41)","v":7.3107049608355096E-2},{"$f":"IF('K2'!E17=\"\",\"\",'K2'!E17)","v":9},null,{"$f":"IF(AJ41=\"\",\"\",AJ41/$Q41)","v":2.3498694516971279E-2},{"$f":"IF('K2'!E18=\"\",\"\",'K2'!E18)","v":133},null,{"$f":"IF(AM41=\"\",\"\",AM41/$Q41)","v":0.3472584856396867}]
[null,"L1  -  Les Barres",null,null,{"$f":"IF('L1'!$E7=\"\",\"\",'L1'!$E7)","v":1336},null,{"$f":"IF('L1'!$E8=\"\",\"\",'L1'!$E8)","v":759},null,{"$f":"IF('L1'!$E9=\"\",\"\",'L1'!$E9)","v":759},null,577,null,0.56811377245508987,null,{"$f":"IF('L1'!$E10=\"\",\"\",'L1'!$E10)","v":19},null,{"$f":"IF('L1'!$E11=\"\",\"\",'L1'!$E11)","v":740},null,0.55389221556886226,null,{"$f":"IF('L1'!$E12=\"\",\"\",'L1'!$E12)","v":34},null,{"$f":"IF(U42=\"\",\"\",U42/$Q42)","v":4.5945945945945948E-2},{"$f":"IF('L1'!$E13=\"\",\"\",'L1'!$E13)","v":108},null,{"$f":"IF(X42=\"\",\"\",X42/$Q42)","v":0.14594594594594595},{"$f":"IF('L1'!$E14=\"\",\"\",'L1'!$E14)","v":143},null,{"$f":"IF(AA42=\"\",\"\",AA42/$Q42)","v":0.19324324324324324},{"$f":"IF('L1'!$E15=\"\",\"\",'L1'!$E15)","v":132},null,{"$f":"IF(AD42=\"\",\"\",AD42/$Q42)","v":0.17837837837837839},{"$f":"IF('L1'!E16=\"\",\"\",'L1'!E16)","v":97},null,{"$f":"IF(AG42=\"\",\"\",AG42/$Q42)","v":0.13108108108108107},{"$f":"IF('L1'!E17=\"\",\"\",'L1'!E17)","v":16},null,{"$f":"IF(AJ42=\"\",\"\",AJ42/$Q42)","v":2.1621621621621623E-2},{"$f":"IF('L1'!E18=\"\",\"\",'L1'!E18)","v":210},null,{"$f":"IF(AM42=\"\",\"\",AM42/$Q42)","v":0.28378378378378377}]
[null,"L2  -  Les Barres",null,null,{"$f":"IF('L2'!$E7=\"\",\"\",'L2'!$E7)","v":1155},null,{"$f":"IF('L2'!$E8=\"\",\"\",'L2'!$E8)","v":709},null,{"$f":"IF('L2'!$E9=\"\",\"\",'L2'!$E9)","v":709},null,446,null,0.61385281385281387,null,{"$f":"IF('L2'!$E10=\"\",\"\",'L2'!$E10)","v":35},null,{"$f":"IF('L2'!$E11=\"\",\"\",'L2'!$E11)","v":674},null,0.5835497835497836,null,{"$f":"IF('L2'!$E12=\"\",\"\",'L2'!$E12)","v":47},null,{"$f":"IF(U43=\"\",\"\",U43/$Q43)","v":6.9732937685459948E-2},{"$f":"IF('L2'!$E13=\"\",\"\",'L2'!$E13)","v":103},null,{"$f":"IF(X43=\"\",\"\",X43/$Q43)","v":0.15281899109792285},{"$f":"IF('L2'!$E14=\"\",\"\",'L2'!$E14)","v":148},null,{"$f":"IF(AA43=\"\",\"\",AA43/$Q43)","v":0.21958456973293769},{"$f":"IF('L2'!$E15=\"\",\"\",'L2'!$E15)","v":86},null,{"$f":"IF(AD43=\"\",\"\",AD43/$Q43)","v":0.12759643916913946},{"$f":"IF('L2'!E16=\"\",\"\",'L2'!E16)","v":102},null,{"$f":"IF(AG43=\"\",\"\",AG43/$Q43)","v":0.1513353115727003},{"$f":"IF('L2'!E17=\"\",\"\",'L2'!E17)","v":18},null,{"$f":"IF(AJ43=\"\",\"\",AJ43/$Q43)","v":2.6706231454005934E-2},{"$f":"IF('L2'!E18=\"\",\"\",'L2'!E18)","v":170},null,{"$f":"IF(AM43=\"\",\"\",AM43/$Q43)","v":0.25222551928783382}]
[null,"Canton OUEST",null,null,{"$f":"SUM(E$40:E$43)","v":4239},null,{"$f":"SUM(G40:G43)","v":2350},null,{"$f":"SUM(I40:I43)","v":2350},null,1889,null,0.55437603208303843,null,{"$f":"SUM(O40:O43)","v":84},null,{"$f":"SUM(Q40:Q43)","v":2266},null,0.53456003774475114,null,{"$f":"SUM(U40:U43)","v":101},null,{"$f":"IF(U44=0,\"\",U44/$Q44)","v":4.4571932921447482E-2},{"$f":"SUM(X40:X43)","v":310},null,{"$f":"IF(X44=0,\"\",X44/$Q44)","v":0.13680494263018536},{"$f":"SUM(AA40:AA43)","v":572},null,{"$f":"IF(AA44=0,\"\",AA44/$Q44)","v":0.25242718446601942},{"$f":"SUM(AD40:AD43)","v":287},null,{"$f":"IF(AD44=0,\"\",AD44/$Q44)","v":0.12665489849955869},{"$f":"SUM(AG40:AG43)","v":257},null,{"$f":"IF(AG44=0,\"\",AG44/$Q44)","v":0.11341571050308914},{"$f":"SUM(AJ40:AJ43)","v":53},null,{"$f":"IF(AJ44=0,\"\",AJ44/$Q44)","v":2.3389232127096204E-2},{"$f":"SUM(AM40:AM43)","v":686},null,{"$f":"IF(AM44=0,\"\",AM44/$Q44)","v":0.30273609885260372}]
[]
[]
[null,"TOTAUX",null,null,{"$f":"E$19+E$26+E$32+E$39+E$44","v":26948},null,{"$f":"G$19+G$26+G$32+G$39+G$44","v":15292},null,{"$f":"I$19+I$26+I$32+I$39+I$44","v":15292},null,{"$f":"K$19+K$26+K$32+K$39+K$44","v":11656},null,{"$f":"IF(I47=\"\",\" \",I47/$E47)","v":0.5674632625797833},null,{"$f":"O$19+O$26+O$32+O$39+O$44","v":487},null,{"$f":"Q$19+Q$26+Q$32+Q$39+Q$44","v":14805},null,null,null,{"$f":"U$19+U$26+U$32+U$39+U$44","v":704},null,{"$f":"IF(U47=0,\"\",U47/$Q47)","v":4.755150287065181E-2},{"$f":"X$19+X$26+X$32+X$39+X$44","v":1780},null,{"$f":"IF(X47=0,\"\",X47/$Q47)","v":0.12022965214454576},{"$f":"AA$19+AA$26+AA$32+AA$39+AA$44","v":3165},null,{"$f":"IF(AA47=0,\"\",AA47/$Q47)","v":0.21377912867274571},{"$f":"AD$19+AD$26+AD$32+AD$39+AD$44","v":1617},null,{"$f":"IF(AD47=0,\"\",AD47/$Q47)","v":0.10921985815602837},{"$f":"AG$19+AG$26+AG$32+AG$39+AG$44","v":2321},null,{"$f":"IF(AG47=0,\"\",AG47/$Q47)","v":0.15677136102668018},{"$f":"AJ$19+AJ$26+AJ$32+AJ$39+AJ$44","v":293},null,{"$f":"IF(AJ47=0,\"\",AJ47/$Q47)","v":1.9790611279972982E-2},{"$f":"AM$19+AM$26+AM$32+AM$39+AM$44","v":4925},null,{"$f":"IF(AM47=0,\"\",AM47/$Q47)","v":0.33265788584937522}]
[]
[null,"%     /    Inscrits",null,null,null,null,null,null,null,null,null,null,null,null,{"$f":"IF(I47=0,0,O47/E47)","v":1.8071842066201573E-2},null,{"$f":"IF(I47=0,0,Q47/E47)","v":0.5493914205135817},null,null,null,{"$f":"IF(Q47=0,0,U47/E47)","v":2.6124387709663056E-2},null,null,{"$f":"IF(Q47=0,0,X47/E47)","v":6.6053139379545794E-2},null,null,{"$f":"IF(Q47=0,0,AA47/E47)","v":0.11744841917767553},null,null,{"$f":"IF(Q47=0,0,AD47/E47)","v":6.0004453020632328E-2},null,null,{"$f":"IF($Q$47=0,0,AG47/E47)","v":8.6128840730295378E-2},null,null,{"$f":"IF($Q$47=0,0,AJ47/E47)","v":1.087279204393647E-2},null,null,{"$f":"IF($Q$47=0,0,AM47/E47)","v":0.18275938845183315}]
[{"$f":"IF(OR(('REPART VdB 1T'!C16>='REPART VdB 1T'!$P$5),('REPART VdB 1T'!$E$16>='REPART VdB 1T'!$P$5),('REPART VdB 1T'!$G$16>='REPART VdB 1T'!$P$5),('REPART VdB 1T'!$I$16>='REPART VdB 1T'!$P$5),('REPART VdB 1T'!$O$16>='REPART VdB 1T'!$P$5)),\"\",\"Second tour\")","v":"Second tour"},null,null,null,null,null,null,null,null,null,null,null,null,null,null,null,null,null,null,null,{"$f":"IF('REPART VdB 1T'!$C16=0,\"\",IF(AND('REPART VdB 1T'!$C16>='REPART VdB 1T'!$P5,'REPART VdB 1T'!$C16>='REPART VdB 1T'!$P6),\"ELU\",IF('REPART VdB 1T'!$P10=\"Non\",IF('REPART VdB 1T'!$C16>='REPART VdB 1T'!$P7,\"Maintien possible\",IF('REPART VdB 1T'!$C16>='REPART VdB 1T'!$P8,\"Fusion possible\",\"\")),\"\")))","v":""},null,null,{"$f":"IF('REPART VdB 1T'!$E16=0,\"\",IF(AND('REPART VdB 1T'!$E16>='REPART VdB 1T'!$P5,'REPART VdB 1T'!$E16>='REPART VdB 1T'!$P6),\"ELU\",IF('REPART VdB 1T'!$P10=\"Non\",IF('REPART VdB 1T'!$E16>='REPART VdB 1T'!$P7,\"Maintien possible\",IF('REPART VdB 1T'!$E16>='REPART VdB 1T'!$P8,\"Fusion possible\",\"\")),\"\")))","v":"Maintien possible"},null,null,{"$f":"IF('REPART VdB 1T'!$G16=0,\"\",IF(AND('REPART VdB 1T'!$G16>='REPART VdB 1T'!$P5,'REPART VdB 1T'!$G16>='REPART VdB 1T'!$P6),\"ELU\",IF('REPART VdB 1T'!$P10=\"Non\",IF('REPART VdB 1T'!$G16>='REPART VdB 1T'!$P7,\"Maintien possible\",IF('REPART VdB 1T'!$G16>='REPART VdB 1T'!$P8,\"Fusion possible\",\"\")),\"\")))","v":"Maintien possible"},null,null,{"$f":"IF('REPART VdB 1T'!$I16=0,\"\",IF(AND('REPART VdB 1T'!$I16>='REPART VdB 1T'!$P5,'REPART VdB 1T'!$I16>='REPART VdB 1T'!$P6),\"ELU\",IF('REPART VdB 1T'!$P10=\"Non\",IF('REPART VdB 1T'!$I16>='REPART VdB 1T'!$P7,\"Maintien possible\",IF('REPART VdB 1T'!$I16>='REPART VdB 1T'!$P8,\"Fusion possible\",\"\")),\"\")))","v":"Maintien possible"},null,null,{"$f":"IF('REPART VdB 1T'!$K16=0,\"\",IF(AND('REPART VdB 1T'!$K16>='REPART VdB 1T'!$P5,'REPART VdB 1T'!$K16>='REPART VdB 1T'!$P6),\"ELU\",IF('REPART VdB 1T'!$P10=\"Non\",IF('REPART VdB 1T'!$K16>='REPART VdB 1T'!$P7,\"Maintien possible\",IF('REPART VdB 1T'!$K16>='REPART VdB 1T'!$P8,\"Fusion possible\",\"\")),\"\")))","v":"Maintien possible"},null,null,{"$f":"IF('REPART VdB 1T'!$M16=0,\"\",IF(AND('REPART VdB 1T'!$M16>='REPART VdB 1T'!$P5,'REPART VdB 1T'!$M16>='REPART VdB 1T'!$P6),\"ELU\",IF('REPART VdB 1T'!$P10=\"Non\",IF('REPART VdB 1T'!$M16>='REPART VdB 1T'!$P7,\"Maintien possible\",IF('REPART VdB 1T'!$M16>='REPART VdB 1T'!$P8,\"Fusion possible\",\"\")),\"\")))","v":""},null,null,{"$f":"IF('REPART VdB 1T'!$O16=0,\"\",IF(AND('REPART VdB 1T'!$O16>='REPART VdB 1T'!$P5,'REPART VdB 1T'!$O16>='REPART VdB 1T'!$P6),\"ELU\",IF('REPART VdB 1T'!$P10=\"Non\",IF('REPART VdB 1T'!$O16>='REPART VdB 1T'!$P7,\"Maintien possible\",IF('REPART VdB 1T'!$O16>='REPART VdB 1T'!$P8,\"Fusion possible\",\"\")),\"\")))","v":"Maintien possible"}]

{"sheet":"RECENS 1T","index":34,"n_rows":42,"n_cols":30,"rows_kept":42,"cut":false,"hidden":false,"merged":[[8,17,8,18],[7,25,7,26],[8,25,8,26],[8,23,8,24],[8,21,8,22],[7,17,7,18],[7,19,7,20],[7,21,7,22],[7,23,7,24],[7,27,7,28],[8,27,8,28],[7,29,7,30],[8,29,8,30],[8,19,8,20]]}
[]
[]
[null,null,null,null,null,null,"R E C E N S E M E N T   par   B U R E A U"]
[]
[]
[]
[]
[null,null,null,null,null,null,null,null,null,null,null,null,null,null,null,null,null,{"$f":"Candidats!A2","v":"Bertrand"},null,{"$f":"Candidats!A3","v":"Marc"},null,{"$f":"Candidats!A4","v":"Étienne"},null,{"$f":"Candidats!A5","v":"Bastien"},null,{"$f":"Candidats!A6","v":"Christophe"},null,{"$f":"Candidats!A7","v":"Jean-Marie"},null,{"$f":"Candidats!A8","v":"Damien"}]
[null,null,null,"BUREAUX",null,"Inscrits",null,"Émargements",null,"Abstentions",null,"Votants",null,"Nuls",null,"Exprimés",null,{"$f":"Candidats!B2","v":"CHEVALIER"},null,{"$f":"Candidats!B3","v":"ARCHAMBAULT"},null,{"$f":"Candidats!B4","v":"BUTZBACH"},null,{"$f":"Candidats!B5","v":"FAUDOT"},null,{"$f":"Candidats!B6","v":"GRUDLER"},null,{"$f":"Candidats!B7","v":"PHEULPIN"},null,{"$f":"Candidats!B8","v":"MESLOT"}]
[null,null,null,1,null,2,null,3,null,4,null,5,null,6,null,7,null,8,null,9,null,10,null,11,null,12,null,13,null,14]
[]
[]
["A","01","-"," Hôtel de Ville  ","E",{"$f":"RESULTATS!E12","v":949},null,{"$f":"RESULTATS!G12","v":508},null,{"$f":"RESULTATS!K12","v":441},null,{"$f":"RESULTATS!I12","v":508},null,{"$f":"RESULTATS!O12","v":12},null,{"$f":"RESULTATS!Q12","v":496},null,{"$f":"RESULTATS!U12","v":20},null,{"$f":"RESULTATS!X12","v":32},null,{"$f":"RESULTATS!AA12","v":104},null,{"$f":"RESULTATS!AD12","v":60},null,{"$f":"RESULTATS!AG12","v":105},null,{"$f":"RESULTATS!AJ12","v":8},null,{"$f":"RESULTATS!AM12","v":167}]
["A","02","-","Salle des fêtes ","E",{"$f":"RESULTATS!E13","v":956},null,{"$f":"RESULTATS!G13","v":610},null,{"$f":"RESULTATS!K13","v":346},null,{"$f":"RESULTATS!I13","v":610},null,{"$f":"RESULTATS!O13","v":18},null,{"$f":"RESULTATS!Q13","v":592},null,{"$f":"RESULTATS!U13","v":29},null,{"$f":"RESULTATS!X13","v":42},null,{"$f":"RESULTATS!AA13","v":107},null,{"$f":"RESULTATS!AD13","v":69},null,{"$f":"RESULTATS!AG13","v":105},null,{"$f":"RESULTATS!AJ13","v":7},null,{"$f":"RESULTATS!AM13","v":233}]
["B","01","-","Victor Hugo","E",{"$f":"RESULTATS!E14","v":1096},null,{"$f":"RESULTATS!G14","v":623},null,{"$f":"RESULTATS!K14","v":474},null,{"$f":"RESULTATS!I14","v":622},null,{"$f":"RESULTATS!O14","v":11},null,{"$f":"RESULTATS!Q14","v":611},null,{"$f":"RESULTATS!U14","v":26},null,{"$f":"RESULTATS!X14","v":46},null,{"$f":"RESULTATS!AA14","v":132},null,{"$f":"RESULTATS!AD14","v":71},null,{"$f":"RESULTATS!AG14","v":115},null,{"$f":"RESULTATS!AJ14","v":9},null,{"$f":"RESULTATS!AM14","v":212}]
["B","02","-","Victor Hugo","E",{"$f":"RESULTATS!E15","v":1167},null,{"$f":"RESULTATS!G15","v":715},null,{"$f":"RESULTATS!K15","v":452},null,{"$f":"RESULTATS!I15","v":715},null,{"$f":"RESULTATS!O15","v":15},null,{"$f":"RESULTATS!Q15","v":700},null,{"$f":"RESULTATS!U15","v":37},null,{"$f":"RESULTATS!X15","v":57},null,{"$f":"RESULTATS!AA15","v":126},null,{"$f":"RESULTATS!AD15","v":87},null,{"$f":"RESULTATS!AG15","v":126},null,{"$f":"RESULTATS!AJ15","v":12},null,{"$f":"RESULTATS!AM15","v":255}]
["M","01","-","Saint-Exupéry","E",{"$f":"RESULTATS!E16","v":1306},null,{"$f":"RESULTATS!G16","v":599},null,{"$f":"RESULTATS!K16","v":707},null,{"$f":"RESULTATS!I16","v":599},null,{"$f":"RESULTATS!O16","v":18},null,{"$f":"RESULTATS!Q16","v":581},null,{"$f":"RESULTATS!U16","v":23},null,{"$f":"RESULTATS!X16","v":50},null,{"$f":"RESULTATS!AA16","v":215},null,{"$f":"RESULTATS!AD16","v":50},null,{"$f":"RESULTATS!AG16","v":112},null,{"$f":"RESULTATS!AJ16","v":8},null,{"$f":"RESULTATS!AM16","v":123}]
["N","01","-","Jean Moulin","E",{"$f":"RESULTATS!E17","v":1456},null,{"$f":"RESULTATS!G17","v":825},null,{"$f":"RESULTATS!K17","v":631},null,{"$f":"RESULTATS!I17","v":825},null,{"$f":"RESULTATS!O17","v":17},null,{"$f":"RESULTATS!Q17","v":808},null,{"$f":"RESULTATS!U17","v":32},null,{"$f":"RESULTATS!X17","v":111},null,{"$f":"RESULTATS!AA17","v":150},null,{"$f":"RESULTATS!AD17","v":78},null,{"$f":"RESULTATS!AG17","v":176},null,{"$f":"RESULTATS!AJ17","v":12},null,{"$f":"RESULTATS!AM17","v":249}]
["N","02","-","Cité des Associations","E",{"$f":"RESULTATS!E18","v":905},null,{"$f":"RESULTATS!G18","v":577},null,{"$f":"RESULTATS!K18","v":328},null,{"$f":"RESULTATS!I18","v":577},null,{"$f":"RESULTATS!O18","v":11},null,{"$f":"RESULTATS!Q18","v":566},null,{"$f":"RESULTATS!U18","v":25},null,{"$f":"RESULTATS!X18","v":44},null,{"$f":"RESULTATS!AA18","v":113},null,{"$f":"RESULTATS!AD18","v":67},null,{"$f":"RESULTATS!AG18","v":167},null,{"$f":"RESULTATS!AJ18","v":5},null,{"$f":"RESULTATS!AM18","v":145}]
["C","01","-","Victor Schoelcher","C",{"$f":"RESULTATS!E20","v":1210},null,{"$f":"RESULTATS!G20","v":719},null,{"$f":"RESULTATS!K20","v":491},null,{"$f":"RESULTATS!I20","v":719},null,{"$f":"RESULTATS!O20","v":17},null,{"$f":"RESULTATS!Q20","v":702},null,{"$f":"RESULTATS!U20","v":24},null,{"$f":"RESULTATS!X20","v":65},null,{"$f":"RESULTATS!AA20","v":153},null,{"$f":"RESULTATS!AD20","v":89},null,{"$f":"RESULTATS!AG20","v":92},null,{"$f":"RESULTATS!AJ20","v":9},null,{"$f":"RESULTATS!AM20","v":270}]
["C","02","-","Maison du Peuple","C",{"$f":"RESULTATS!E21","v":763},null,{"$f":"RESULTATS!G21","v":474},null,{"$f":"RESULTATS!K21","v":289},null,{"$f":"RESULTATS!I21","v":474},null,{"$f":"RESULTATS!O21","v":11},null,{"$f":"RESULTATS!Q21","v":463},null,{"$f":"RESULTATS!U21","v":23},null,{"$f":"RESULTATS!X21","v":43},null,{"$f":"RESULTATS!AA21","v":82},null,{"$f":"RESULTATS!AD21","v":54},null,{"$f":"RESULTATS!AG21","v":58},null,{"$f":"RESULTATS!AJ21","v":5},null,{"$f":"RESULTATS!AM21","v":198}]
["C","03","-","Maison du Peuple","C",{"$f":"RESULTATS!E22","v":921},null,{"$f":"RESULTATS!G22","v":564},null,{"$f":"RESULTATS!K22","v":357},null,{"$f":"RESULTATS!I22","v":564},null,{"$f":"RESULTATS!O22","v":12},null,{"$f":"RESULTATS!Q22","v":552},null,{"$f":"RESULTATS!U22","v":19},null,{"$f":"RESULTATS!X22","v":48},null,{"$f":"RESULTATS!AA22","v":105},null,{"$f":"RESULTATS!AD22","v":56},null,{"$f":"RESULTATS!AG22","v":62},null,{"$f":"RESULTATS!AJ22","v":6},null,{"$f":"RESULTATS!AM22","v":256}]
["D","01","-","Châteaudun","C",{"$f":"RESULTATS!E23","v":1074},null,{"$f":"RESULTATS!G23","v":613},null,{"$f":"RESULTATS!K23","v":461},null,{"$f":"RESULTATS!I23","v":613},null,{"$f":"RESULTATS!O23","v":17},null,{"$f":"RESULTATS!Q23","v":596},null,{"$f":"RESULTATS!U23","v":14},null,{"$f":"RESULTATS!X23","v":70},null,{"$f":"RESULTATS!AA23","v":103},null,{"$f":"RESULTATS!AD23","v":51},null,{"$f":"RESULTATS!AG23","v":80},null,{"$f":"RESULTATS!AJ23","v":7},null,{"$f":"RESULTATS!AM23","v":271}]
["D","02","-","Châteaudun","C",{"$f":"RESULTATS!E24","v":838},null,{"$f":"RESULTATS!G24","v":503},null,{"$f":"RESULTATS!K24","v":335},null,{"$f":"RESULTATS!I24","v":503},null,{"$f":"RESULTATS!O24","v":22},null,{"$f":"RESULTATS!Q24","v":481},null,{"$f":"RESULTATS!U24","v":20},null,{"$f":"RESULTATS!X24","v":56},null,{"$f":"RESULTATS!AA24","v":67},null,{"$f":"RESULTATS!AD24","v":56},null,{"$f":"RESULTATS!AG24","v":78},null,{"$f":"RESULTATS!AJ24","v":7},null,{"$f":"RESULTATS!AM24","v":197}]
["D","03","-","Châteaudun","C",{"$f":"RESULTATS!E25","v":912},null,{"$f":"RESULTATS!G25","v":554},null,{"$f":"RESULTATS!K25","v":358},null,{"$f":"RESULTATS!I25","v":554},null,{"$f":"RESULTATS!O25","v":18},null,{"$f":"RESULTATS!Q25","v":536},null,{"$f":"RESULTATS!U25","v":37},null,{"$f":"RESULTATS!X25","v":91},null,{"$f":"RESULTATS!AA25","v":70},null,{"$f":"RESULTATS!AD25","v":47},null,{"$f":"RESULTATS!AG25","v":76},null,{"$f":"RESULTATS!AJ25","v":16},null,{"$f":"RESULTATS!AM25","v":199}]
["E","01","-","Raymond Aubert","N",{"$f":"RESULTATS!E27","v":1181},null,{"$f":"RESULTATS!G27","v":668},null,{"$f":"RESULTATS!K27","v":513},null,{"$f":"RESULTATS!I27","v":668},null,{"$f":"RESULTATS!O27","v":19},null,{"$f":"RESULTATS!Q27","v":649},null,{"$f":"RESULTATS!U27","v":23},null,{"$f":"RESULTATS!X27","v":96},null,{"$f":"RESULTATS!AA27","v":88},null,{"$f":"RESULTATS!AD27","v":88},null,{"$f":"RESULTATS!AG27","v":92},null,{"$f":"RESULTATS!AJ27","v":18},null,{"$f":"RESULTATS!AM27","v":244}]
["E","02","-","Raymond Aubert","N",{"$f":"RESULTATS!E28","v":1212},null,{"$f":"RESULTATS!G28","v":680},null,{"$f":"RESULTATS!K27","v":513},null,{"$f":"RESULTATS!I28","v":681},null,{"$f":"RESULTATS!O28","v":28},null,{"$f":"RESULTATS!Q28","v":653},null,{"$f":"RESULTATS!U28","v":18},null,{"$f":"RESULTATS!X28","v":115},null,{"$f":"RESULTATS!AA28","v":122},null,{"$f":"RESULTATS!AD28","v":51},null,{"$f":"RESULTATS!AG28","v":92},null,{"$f":"RESULTATS!AJ28","v":14},null,{"$f":"RESULTATS!AM28","v":241}]
["E","03","-","Raymond Aubert","N",{"$f":"RESULTATS!E29","v":1038},null,{"$f":"RESULTATS!G29","v":564},null,{"$f":"RESULTATS!K28","v":531},null,{"$f":"RESULTATS!I29","v":564},null,{"$f":"RESULTATS!O29","v":24},null,{"$f":"RESULTATS!Q29","v":540},null,{"$f":"RESULTATS!U29","v":21},null,{"$f":"RESULTATS!X29","v":94},null,{"$f":"RESULTATS!AA29","v":121},null,{"$f":"RESULTATS!AD29","v":60},null,{"$f":"RESULTATS!AG29","v":61},null,{"$f":"RESULTATS!AJ29","v":16},null,{"$f":"RESULTATS!AM29","v":167}]
["F","01","-","Maison de l'enfant","N",{"$f":"RESULTATS!E30","v":776},null,{"$f":"RESULTATS!G30","v":459},null,{"$f":"RESULTATS!K29","v":474},null,{"$f":"RESULTATS!I30","v":459},null,{"$f":"RESULTATS!O30","v":18},null,{"$f":"RESULTATS!Q30","v":441},null,{"$f":"RESULTATS!U30","v":29},null,{"$f":"RESULTATS!X30","v":57},null,{"$f":"RESULTATS!AA30","v":106},null,{"$f":"RESULTATS!AD30","v":31},null,{"$f":"RESULTATS!AG30","v":94},null,{"$f":"RESULTATS!AJ30","v":9},null,{"$f":"RESULTATS!AM30","v":115}]
["F","02","-","Émile Géhant","N",{"$f":"RESULTATS!E31","v":522},null,{"$f":"RESULTATS!G31","v":299},null,{"$f":"RESULTATS!K30","v":317},null,{"$f":"RESULTATS!I31","v":299},null,{"$f":"RESULTATS!O31","v":13},null,{"$f":"RESULTATS!Q31","v":286},null,{"$f":"RESULTATS!U31","v":27},null,{"$f":"RESULTATS!X31","v":53},null,{"$f":"RESULTATS!AA31","v":49},null,{"$f":"RESULTATS!AD31","v":34},null,{"$f":"RESULTATS!AG31","v":40},null,{"$f":"RESULTATS!AJ31","v":24},null,{"$f":"RESULTATS!AM31","v":59}]
["G","01","-","Hubert Metzger","S",{"$f":"RESULTATS!E33","v":653},null,{"$f":"RESULTATS!G33","v":414},null,{"$f":"RESULTATS!K31","v":223},null,{"$f":"RESULTATS!I33","v":414},null,{"$f":"RESULTATS!O33","v":18},null,{"$f":"RESULTATS!Q33","v":396},null,{"$f":"RESULTATS!U33","v":36},null,{"$f":"RESULTATS!X33","v":54},null,{"$f":"RESULTATS!AA33","v":97},null,{"$f":"RESULTATS!AD33","v":33},null,{"$f":"RESULTATS!AG33","v":68},null,{"$f":"RESULTATS!AJ33","v":9},null,{"$f":"RESULTATS!AM33","v":99}]
["G","02","-","Hubert Metzger","S",{"$f":"RESULTATS!E34","v":755},null,{"$f":"RESULTATS!G34","v":419},null,{"$f":"RESULTATS!K34","v":336},null,{"$f":"RESULTATS!I34","v":419},null,{"$f":"RESULTATS!O34","v":15},null,{"$f":"RESULTATS!Q34","v":404},null,{"$f":"RESULTATS!U34","v":59},null,{"$f":"RESULTATS!X34","v":64},null,{"$f":"RESULTATS!AA34","v":97},null,{"$f":"RESULTATS!AD34","v":31},null,{"$f":"RESULTATS!AG34","v":50},null,{"$f":"RESULTATS!AJ34","v":6},null,{"$f":"RESULTATS!AM34","v":97}]
["H","01","-","Léonard de Vinci","S",{"$f":"RESULTATS!E35","v":1042},null,{"$f":"RESULTATS!G35","v":574},null,{"$f":"RESULTATS!K35","v":468},null,{"$f":"RESULTATS!I35","v":574},null,{"$f":"RESULTATS!O35","v":26},null,{"$f":"RESULTATS!Q35","v":548},null,{"$f":"RESULTATS!U35","v":29},null,{"$f":"RESULTATS!X35","v":64},null,{"$f":"RESULTATS!AA35","v":133},null,{"$f":"RESULTATS!AD35","v":61},null,{"$f":"RESULTATS!AG35","v":64},null,{"$f":"RESULTATS!AJ35","v":15},null,{"$f":"RESULTATS!AM35","v":182}]
["J","01","-","René Rucklin","S",{"$f":"RESULTATS!E36","v":597},null,{"$f":"RESULTATS!G36","v":266},null,{"$f":"RESULTATS!K36","v":331},null,{"$f":"RESULTATS!I36","v":266},null,{"$f":"RESULTATS!O36","v":9},null,{"$f":"RESULTATS!Q36","v":257},null,{"$f":"RESULTATS!U36","v":7},null,{"$f":"RESULTATS!X36","v":50},null,{"$f":"RESULTATS!AA36","v":63},null,{"$f":"RESULTATS!AD36","v":28},null,{"$f":"RESULTATS!AG36","v":43},null,{"$f":"RESULTATS!AJ36","v":3},null,{"$f":"RESULTATS!AM36","v":63}]
["J","02","-","René Rucklin","S",{"$f":"RESULTATS!E37","v":818},null,{"$f":"RESULTATS!G37","v":438},null,{"$f":"RESULTATS!K37","v":380},null,{"$f":"RESULTATS!I37","v":438},null,{"$f":"RESULTATS!O37","v":14},null,{"$f":"RESULTATS!Q37","v":424},null,{"$f":"RESULTATS!U37","v":8},null,{"$f":"RESULTATS!X37","v":42},null,{"$f":"RESULTATS!AA37","v":102},null,{"$f":"RESULTATS!AD37","v":43},null,{"$f":"RESULTATS!AG37","v":79},null,{"$f":"RESULTATS!AJ37","v":13},null,{"$f":"RESULTATS!AM37","v":137}]
["J","03","-","René Rucklin","S",{"$f":"RESULTATS!E38","v":562},null,{"$f":"RESULTATS!G38","v":277},null,{"$f":"RESULTATS!K38","v":285},null,{"$f":"RESULTATS!I38","v":277},null,{"$f":"RESULTATS!O38","v":20},null,{"$f":"RESULTATS!Q38","v":257},null,{"$f":"RESULTATS!U38","v":17},null,{"$f":"RESULTATS!X38","v":26},null,{"$f":"RESULTATS!AA38","v":88},null,{"$f":"RESULTATS!AD38","v":35},null,{"$f":"RESULTATS!AG38","v":29},null,{"$f":"RESULTATS!AJ38","v":2},null,{"$f":"RESULTATS!AM38","v":60}]
["K","01","-","Louis Pergaud","O",{"$f":"RESULTATS!E40","v":959},null,{"$f":"RESULTATS!G40","v":487},null,{"$f":"RESULTATS!K40","v":472},null,{"$f":"RESULTATS!I40","v":487},null,{"$f":"RESULTATS!O40","v":18},null,{"$f":"RESULTATS!Q40","v":469},null,{"$f":"RESULTATS!U40","v":11},null,{"$f":"RESULTATS!X40","v":53},null,{"$f":"RESULTATS!AA40","v":153},null,{"$f":"RESULTATS!AD40","v":39},null,{"$f":"RESULTATS!AG40","v":30},null,{"$f":"RESULTATS!AJ40","v":10},null,{"$f":"RESULTATS!AM40","v":173}]
["K","02","-","Louis Pergaud","O",{"$f":"RESULTATS!E41","v":789},null,{"$f":"RESULTATS!G41","v":395},null,{"$f":"RESULTATS!K41","v":394},null,{"$f":"RESULTATS!I41","v":395},null,{"$f":"RESULTATS!O41","v":12},null,{"$f":"RESULTATS!Q41","v":383},null,{"$f":"RESULTATS!U41","v":9},null,{"$f":"RESULTATS!X41","v":46},null,{"$f":"RESULTATS!AA41","v":128},null,{"$f":"RESULTATS!AD41","v":30},null,{"$f":"RESULTATS!AG41","v":28},null,{"$f":"RESULTATS!AJ41","v":9},null,{"$f":"RESULTATS!AM41","v":133}]
["L","01","-","Les Barres","O",{"$f":"RESULTATS!E42","v":1336},null,{"$f":"RESULTATS!G42","v":759},null,{"$f":"RESULTATS!K42","v":577},null,{"$f":"RESULTATS!I42","v":759},null,{"$f":"RESULTATS!O42","v":19},null,{"$f":"RESULTATS!Q42","v":740},null,{"$f":"RESULTATS!U42","v":34},null,{"$f":"RESULTATS!X42","v":108},null,{"$f":"RESULTATS!AA42","v":143},null,{"$f":"RESULTATS!AD42","v":132},null,{"$f":"RESULTATS!AG42","v":97},null,{"$f":"RESULTATS!AJ42","v":16},null,{"$f":"RESULTATS!AM42","v":210}]
["L","02","-","Les Barres","O",{"$f":"RESULTATS!E43","v":1155},null,{"$f":"RESULTATS!G43","v":709},null,{"$f":"RESULTATS!K43","v":446},null,{"$f":"RESULTATS!I43","v":709},null,{"$f":"RESULTATS!O43","v":35},null,{"$f":"RESULTATS!Q43","v":674},null,{"$f":"RESULTATS!U43","v":47},null,{"$f":"RESULTATS!X43","v":103},null,{"$f":"RESULTATS!AA43","v":148},null,{"$f":"RESULTATS!AD43","v":86},null,{"$f":"RESULTATS!AG43","v":102},null,{"$f":"RESULTATS!AJ43","v":18},null,{"$f":"RESULTATS!AM43","v":170}]
[]
[null,null,null,"TOTAUX",null,{"$f":"SUM(F13:F41)","v":26948},null,{"$f":"SUM(H13:H41)","v":15292},null,{"$f":"SUM(J13:J41)","v":11930},null,{"$f":"SUM(L13:L41)","v":15292},null,{"$f":"SUM(N13:N41)","v":487},null,{"$f":"SUM(P13:P41)","v":14805},null,{"$f":"SUM(R13:R41)","v":704},null,{"$f":"SUM(T13:T41)","v":1780},null,{"$f":"SUM(V13:V41)","v":3165},null,{"$f":"SUM(X13:X41)","v":1617},null,{"$f":"SUM(Z13:Z41)","v":2321},null,{"$f":"SUM(AB13:AB41)","v":293},null,{"$f":"SUM(AD13:AD41)","v":4925}]

{"sheet":"REPART VdB 1T","index":35,"n_rows":57,"n_cols":16,"rows_kept":57,"cut":false,"hidden":false,"merged":[[12,14,12,15],[12,2,12,3],[12,4,12,5],[12,6,12,7],[12,8,12,9],[12,10,12,11],[12,12,12,13],[23,14,23,15],[23,2,23,3],[23,4,23,5],[23,6,23,7],[23,8,23,9],[23,10,23,11],[23,12,23,13]]}
[]
[null,null,"R É P A R T I T I O N   des   S I È G E S   V.d.B."]
[null,null,null,null,null,null,null,null,null,null,null,null,null,null,"Nombre de sièges à répartir",45]
[null,null,null,null,null,null,null,null,null,null,null,null,null,null," Majorité absolue des sièges",{"$f":"INT($P$3/2)+1","v":23}]
[null,null,null,null,null,null,null,null,null,null,null,null,null,null," Majorité absolue des Exprimés",{"$f":"INT(RESULTATS!Q47/2)+1","v":7403}]
[null,null,null,null,null,null,null,null,null,null,null,null,null,null,"25% des Inscrits",{"$f":"INT(SUM(RESULTATS!X5*25%))","v":6737}]
[null,null,null,null,null,null,null,null,null,null,null,null,null,null,"10% des Exprimés",{"$f":"INT(SUM(RESULTATS!Q47*10%))","v":1480}]
[{"$f":"IF(OR(($C$16>=$P$5),($E$16>=$P$5),($G$16>=$P$5),($I$16>=$P$5),($O$16>=$P$5)),\"1er TOUR\",\"AUCUNE LISTE NE REUNIT LA MOITIE DES SUFFRAGES, IL Y A NECESSITE D'UN SECOND TOUR\")","v":"AUCUNE LISTE NE REUNIT LA MOITIE DES SUFFRAGES, IL Y A NECESSITE D'UN SECOND TOUR"},null,null,null,null,null,null,null,null,null,null,null,null,null,"5% des Exprimés",{"$f":"INT(SUM(RESULTATS!Q47*5%))","v":740}]
[null,null,null,null,null,null,null,null,null,null,null,null,null,null,"Quotient Electoral (1)",{"$f":"INT(SUMIF(C22:O22,\">0\",C16:O16)/(P3-P4))","v":627}]
[null,null,null,null,null,null,null,null,null,null,null,null,null,null,"1 élu",{"$f":"IF(OR(AND(C16>=P5,C16>=P6),AND(E16>=P5,E16>=P6),AND(G16>=P5,G16>=P6),AND(I16>=P5,I16>=P6),AND(O16>=P5,O16>=P6)),\"Oui\",\"Non\")","v":"Non"}]
[]
[]
[null,null,{"$f":"Candidats!A2&\" \"&Candidats!B2","v":"Bertrand CHEVALIER"},null,{"$f":"Candidats!A3&\" \"&Candidats!B3","v":"Marc ARCHAMBAULT"},null,{"$f":"Candidats!A4&\" \"&Candidats!B4","v":"Étienne BUTZBACH"},null,{"$f":"Candidats!A5&\" \"&Candidats!B5","v":"Bastien FAUDOT"},null,{"$f":"Candidats!A6&\" \"&Candidats!B6","v":"Christophe GRUDLER"},null,{"$f":"Candidats!A7&\" \"&Candidats!B7","v":"Jean-Marie PHEULPIN"},null,{"$f":"Candidats!A8&\" \"&Candidats!B8","v":"Damien MESLOT"}]
[]
[]
["Suffrages Exprimés",null,{"$f":"RESULTATS!U47","v":704},null,{"$f":"RESULTATS!X47","v":1780},null,{"$f":"RESULTATS!AA47","v":3165},null,{"$f":"RESULTATS!AD47","v":1617},null,{"$f":"RESULTATS!AG47","v":2321},null,{"$f":"RESULTATS!AJ47","v":293},null,{"$f":"RESULTATS!AM47","v":4925}]
[]
["% des Suffrages Exprimés",null,{"$f":"IF(RESULTATS!$Q$47=0,0,RESULTATS!U47/RESULTATS!$Q$47)","v":4.755150287065181E-2},null,{"$f":"IF(RESULTATS!$Q$47=0,0,RESULTATS!X47/RESULTATS!$Q$47)","v":0.12022965214454576},null,{"$f":"IF(RESULTATS!$Q$47=0,0,RESULTATS!$AA47/RESULTATS!$Q$47)","v":0.21377912867274571},null,{"$f":"IF(RESULTATS!$Q$47=0,0,RESULTATS!$AD47/RESULTATS!$Q$47)","v":0.10921985815602837},null,{"$f":"IF(RESULTATS!$Q$47=0,0,RESULTATS!AG47/RESULTATS!$Q$47)","v":0.15677136102668018},null,{"$f":"IF(RESULTATS!$Q$47=0,0,RESULTATS!$AJ47/RESULTATS!$Q$47)","v":1.9790611279972982E-2},null,{"$f":"IF(RESULTATS!$Q$47=0,0,RESULTATS!$AM47/RESULTATS!$Q$47)","v":0.33265788584937522}]
[]
["Sièges à répartir",{"$f":"P3","v":45}]
[]
["Suffrages à prendre en compte (2)",null,{"$f":"IF(C16>=$P$8,C16,0)","v":0},null,{"$f":"IF(E16>=$P$8,E16,0)","v":1780},null,{"$f":"IF(G16>=$P$8,G16,0)","v":3165},null,{"$f":"IF(I16>=$P$8,I16,0)","v":1617},null,{"$f":"IF(K16>=$P$8,K16,0)","v":2321},null,{"$f":"IF(M16>=$P$8,M16,0)","v":0},null,{"$f":"IF(O16>=$P$8,O16,0)","v":4925}]
[]
[{"$f":"IF(OR(($C$16>=$P$5),($E$16>=$P$5),($G$16>=$P$5),($I$16>=$P$5),($O$16>=$P$5)),\"\",\"Second tour\")","v":"Second tour"},null,{"$f":"IF(OR(($C$16>=$P$5),($E$16>=$P$5),($G$16>=$P$5),($I$16>=$P$5),($O$16>=$P$5)),\"\",IF(C$16>=$P$7,\"Maintien possible\",IF(C$16>=$P$8,\"Fusion possible\",\"\")))","v":""},null,{"$f":"IF(OR(($C$16>=$P$5),($E$16>=$P$5),($G$16>=$P$5),($I$16>=$P$5),($O$16>=$P$5)),\"\",IF(E$16>=$P$7,\"Maintien possible\",IF(E$16>=$P$8,\"Fusion possible\",\"\")))","v":"Maintien possible"},null,{"$f":"IF(OR(($C$16>=$P$5),($E$16>=$P$5),($G$16>=$P$5),($I$16>=$P$5),($O$16>=$P$5)),\"\",IF(G$16>=$P$7,\"Maintien possible\",IF(G$16>=$P$8,\"Fusion possible\",\"\")))","v":"Maintien possible"},null,{"$f":"IF(OR(($C$16>=$P$5),($E$16>=$P$5),($G$16>=$P$5),($I$16>=$P$5),($O$16>=$P$5)),\"\",IF(I$16>=$P$7,\"Maintien possible\",IF(I$16>=$P$8,\"Fusion possible\",\"\")))","v":"Maintien possible"},null,{"$f":"IF(OR(($C$16>=$P$5),($E$16>=$P$5),($G$16>=$P$5),($I$16>=$P$5),($O$16>=$P$5)),\"\",IF(K$16>=$P$7,\"Maintien possible\",IF(K$16>=$P$8,\"Fusion possible\",\"\")))","v":"Maintien possible"},null,{"$f":"IF(OR(($C$16>=$P$5),($E$16>=$P$5),($G$16>=$P$5),($I$16>=$P$5),($O$16>=$P$5)),\"\",IF(M$16>=$P$7,\"Maintien possible\",IF(M$16>=$P$8,\"Fusion possible\",\"\")))","v":""},null,{"$f":"IF(OR(($C$16>=$P$5),($E$16>=$P$5),($G$16>=$P$5),($I$16>=$P$5),($O$16>=$P$5)),\"\",IF(O$16>=$P$7,\"Maintien possible\",IF(O$16>=$P$8,\"Fusion possible\",\"\")))","v":"Maintien possible"}]
["Sièges attribués au scrutin majoritaire (3)",null,{"$f":"IF(AND(C$16>=P6,C$16>=$P$5),$P$4,0)","v":0},null,{"$f":"IF(AND(E$16>=$P$6,E$16>=$P$5),$P$4,0)","v":0},null,{"$f":"IF(AND(G$16>=$P$6,G$16>=$P$5),$P$4,0)","v":0},null,{"$f":"IF(AND(I$16>=$P$6,I$16>=$P$5),$P$4,0)","v":0},null,{"$f":"IF(AND(K$16>=$P$6,K$16>=$P$5),$P$4,0)","v":0},null,{"$f":"IF(AND(M$16>=$P$6,M$16>=$P$5),$P$4,0)","v":0},null,{"$f":"IF(AND(O$16>=$P$6,O$16>=$P$5),$P$4,0)","v":0}]
[]
["Sièges restants",{"$f":"$B$20-SUM($C$25:$O$25)","v":45}]
[]
["Sièges attribués à la proportionnelle (4)",null,{"$f":"IF(OR(SUM($C$25:$O$25)=0,$P$9=0,C22=0),0,INT(C16/$P$9))","v":0},null,{"$f":"IF(OR(SUM($C$25:$O$25)=0,$P$9=0,E22=0),0,INT(E16/$P$9))","v":0},null,{"$f":"IF(OR(SUM($C$25:$O$25)=0,$P$9=0,G22=0),0,INT(G16/$P$9))","v":0},null,{"$f":"IF(OR(SUM($C$25:$O$25)=0,$P$9=0,I22=0),0,INT(I16/$P$9))","v":0},null,{"$f":"IF(OR(SUM($C$25:$O$25)=0,$P$9=0,K22=0),0,INT(K16/$P$9))","v":0},null,{"$f":"IF(OR(SUM($C$25:$O$25)=0,$P$9=0,M22=0),0,INT(M16/$P$9))","v":0},null,{"$f":"IF(OR(SUM($C$25:$O$25)=0,$P$9=0,O22=0),0,INT(O16/$P$9))","v":0}]
[]
["Sièges restants",{"$f":"$B$27-SUM($C$29:$O$29)","v":45}]
[]
["1ère moyenne des listes",null,{"$f":"IF(AND($B$31>=1,$B$31<>$B$27,C22<>0),C16/(C29+1),0)","v":0},null,{"$f":"IF(AND($B$31>=1,$B$31<>$B$27,E22<>0),E16/(E29+1),0)","v":0},null,{"$f":"IF(AND($B$31>=1,$B$31<>$B$27,G22<>0),G16/(G29+1),0)","v":0},null,{"$f":"IF(AND($B$31>=1,$B$31<>$B$27,I22<>0),I16/(I29+1),0)","v":0},null,{"$f":"IF(AND($B$31>=1,$B$31<>$B$27,K22<>0),K16/(K29+1),0)","v":0},null,{"$f":"IF(AND($B$31>=1,$B$31<>$B$27,M22<>0),M16/(M29+1),0)","v":0},null,{"$f":"IF(AND($B$31>=1,$B$31<>$B$27,O22<>0),O16/(O29+1),0)","v":0}]
[]
["Sièges attribués à la 1ère plus forte moyenne",null,{"$f":"IF(AND(MAX($C33:$O33)=C33,$B$31<>0,$B$31<>$B$27),1,0)","v":0},null,{"$f":"IF(AND(MAX($C33:$O33)=E33,$B$31<>0,$B$31<>$B$27),1,0)","v":0},null,{"$f":"IF(AND(MAX($C33:$O33)=G33,$B$31<>0,$B$31<>$B$27),1,0)","v":0},null,{"$f":"IF(AND(MAX($C33:$O33)=I33,$B$31<>0,$B$31<>$B$27),1,0)","v":0},null,{"$f":"IF(AND(MAX($C33:$O33)=K33,$B$31<>0,$B$31<>$B$27),1,0)","v":0},null,{"$f":"IF(AND(MAX($C33:$O33)=M33,$B$31<>0,$B$31<>$B$27),1,0)","v":0},null,{"$f":"IF(AND(MAX($C33:$O33)=O33,$B$31<>0,$B$31<>$B$27),1,0)","v":0}]
[]
["Sièges restants",{"$f":"$B$31-SUM($C$35:$O$35)","v":45}]
[]
["2ème moyenne des listes",null,{"$f":"IF(AND($B$37>=1,$B$37<>$B$31,C22<>0),C16/(C29+C35+1),0)","v":0},null,{"$f":"IF(AND($B$37>=1,$B$37<>$B$31,E22<>0),E16/(E29+E35+1),0)","v":0},null,{"$f":"IF(AND($B$37>=1,$B$37<>$B$31,G22<>0),G16/(G29+G35+1),0)","v":0},null,{"$f":"IF(AND($B$37>=1,$B$37<>$B$31,I22<>0),I16/(I29+I35+1),0)","v":0},null,{"$f":"IF(AND($B$37>=1,$B$37<>$B$31,K22<>0),K16/(K29+K35+1),0)","v":0},null,{"$f":"IF(AND($B$37>=1,$B$37<>$B$31,M22<>0),M16/(M29+M35+1),0)","v":0},null,{"$f":"IF(AND($B$37>=1,$B$37<>$B$31,O22<>0),O16/(O29+O35+1),0)","v":0}]
[]
["Sièges attribués à la 2ème plus forte moyenne",null,{"$f":"IF(AND(MAX($C39:$O39)=C39,$B$37<>0,$B$37<>$B$31),1,0)","v":0},null,{"$f":"IF(AND(MAX($C39:$O39)=E39,$B$37<>0,$B$37<>$B$31),1,0)","v":0},null,{"$f":"IF(AND(MAX($C39:$O39)=G39,$B$37<>0,$B$37<>$B$31),1,0)","v":0},null,{"$f":"IF(AND(MAX($C39:$O39)=I39,$B$37<>0,$B$37<>$B$31),1,0)","v":0},null,{"$f":"IF(AND(MAX($C39:$O39)=K39,$B$37<>0,$B$37<>$B$31),1,0)","v":0},null,{"$f":"IF(AND(MAX($C39:$O39)=M39,$B$37<>0,$B$37<>$B$31),1,0)","v":0},null,{"$f":"IF(AND(MAX($C39:$O39)=O39,$B$37<>0,$B$37<>$B$31),1,0)","v":0}]
[]
["Sièges restants",{"$f":"$B$37-SUM($C$41:$O$41)","v":45}]
[]
["3ème moyenne des listes",null,{"$f":"IF(AND($B$43>=1,$B$43<>$B$37,C22<>0),C16/(C29+C35+C41+1),0)","v":0},null,{"$f":"IF(AND($B$43>=1,$B$43<>$B$37,E22<>0),E16/(E29+E35+E41+1),0)","v":0},null,{"$f":"IF(AND($B$43>=1,$B$43<>$B$37,G22<>0),G16/(G29+G35+G41+1),0)","v":0},null,{"$f":"IF(AND($B$43>=1,$B$43<>$B$37,I22<>0),I16/(I29+I35+I41+1),0)","v":0},null,{"$f":"IF(AND($B$43>=1,$B$43<>$B$37,K22<>0),K16/(K29+K35+K41+1),0)","v":0},null,{"$f":"IF(AND($B$43>=1,$B$43<>$B$37,M22<>0),M16/(M29+M35+M41+1),0)","v":0},null,{"$f":"IF(AND($B$43>=1,$B$43<>$B$37,O22<>0),O16/(O29+O35+O41+1),0)","v":0}]
[]
["Sièges attribués à la 3ème plus forte moyenne",null,{"$f":"IF(AND(MAX($C45:$O45)=C45,$B$43<>0,$B$43<>$B$37),1,0)","v":0},null,{"$f":"IF(AND(MAX($C45:$O45)=E45,$B$43<>0,$B$43<>$B$37),1,0)","v":0},null,{"$f":"IF(AND(MAX($C45:$O45)=G45,$B$43<>0,$B$43<>$B$37),1,0)","v":0},null,{"$f":"IF(AND(MAX($C45:$O45)=I45,$B$43<>0,$B$43<>$B$37),1,0)","v":0},null,{"$f":"IF(AND(MAX($C45:$O45)=K45,$B$43<>0,$B$43<>$B$37),1,0)","v":0},null,{"$f":"IF(AND(MAX($C45:$O45)=M45,$B$43<>0,$B$43<>$B$37),1,0)","v":0},null,{"$f":"IF(AND(MAX($C45:$O45)=O45,$B$43<>0,$B$43<>$B$37),1,0)","v":0}]
[]
["Sièges restants",{"$f":"$B$43-SUM($C$47:$O$47)","v":45}]
[]
[]
["TOTAL DES SIÈGES RÉPARTIS",null,{"$f":"SUM(C25+C29+C35+C41+C47)","v":0},null,{"$f":"SUM(E25+E29+E35+E41+E47)","v":0},null,{"$f":"SUM(G25+G29+G35+G41+G47)","v":0},null,{"$f":"SUM(I25+I29+I35+I41+I47)","v":0},null,{"$f":"SUM(K25+K29+K35+K41+K47)","v":0},null,{"$f":"SUM(M25+M29+M35+M41+M47)","v":0},null,{"$f":"SUM(O25+O29+O35+O41+O47)","v":0}]
[]
[null,null,"(1) Somme des Suffrages Exprimés des listes >= 5% du total des Exprimés / le nombre de sièges restant après répartition au scrutin majoritaire"]
[null,null,"(2) Listes ayant obtenues au mois 5% du total des Exprimés"]
[null,null,"(3) Affectation de la Majorité absolue des sièges (23) à la liste qui a obtenu au moins la majorité absolue des Exprimés"]
[null,null,"(4) Suffrages Exprimés de la liste / Quotient Electoral"]

{"sheet":"REPART CAB 1T","index":36,"n_rows":57,"n_cols":16,"rows_kept":57,"cut":false,"hidden":false,"merged":[[12,14,12,15],[23,2,23,3],[23,4,23,5],[23,6,23,7],[23,8,23,9],[23,10,23,11],[23,12,23,13],[23,14,23,15],[12,2,12,3],[12,4,12,5],[12,6,12,7],[12,8,12,9],[12,10,12,11],[12,12,12,13]]}
[]
[null,null,"R É P A R T I T I O N   des   S I È G E S    C.A.B."]
[null,null,null,null,null,null,null,null,null,null,null,null,null,null,"Nombre de sièges à répartir",30]
[null,null,null,null,null,null,null,null,null,null,null,null,null,null," Majorité absolue des sièges",{"$f":"INT($P$3/2)+1","v":16}]
[null,null,null,null,null,null,null,null,null,null,null,null,null,null," Majorité absolue des Exprimés",{"$f":"INT(RESULTATS!Q47/2)+1","v":7403}]
[null,null,null,null,null,null,null,null,null,null,null,null,null,null,"25% des Inscrits",{"$f":"INT(SUM(RESULTATS!X5*25%))","v":6737}]
[null,null,null,null,null,null,null,null,null,null,null,null,null,null,"10% des Exprimés",{"$f":"INT(SUM(RESULTATS!Q47*10%))","v":1480}]
[{"$f":"IF(OR(($C$16>=$P$5),($E$16>=$P$5),($G$16>=$P$5),($I$16>=$P$5),($O$16>=$P$5)),\"1er TOUR\",\"AUCUNE LISTE NE REUNIT LA MOITIE DES SUFFRAGES, IL Y A NECESSITE D'UN SECOND TOUR\")","v":"AUCUNE LISTE NE REUNIT LA MOITIE DES SUFFRAGES, IL Y A NECESSITE D'UN SECOND TOUR"},null,null,null,null,null,null,null,null,null,null,null,null,null,"5% des Exprimés",{"$f":"INT(SUM(RESULTATS!Q47*5%))","v":740}]
[null,null,null,null,null,null,null,null,null,null,null,null,null,null,"Quotient Electoral (1)",{"$f":"INT(SUMIF(C22:O22,\">0\",C16:O16)/(P3-P4))","v":986}]
[null,null,null,null,null,null,null,null,null,null,null,null,null,null,"1 élu",{"$f":"IF(OR(AND(C16>=P5,C16>=P6),AND(E16>=P5,E16>=P6),AND(G16>=P5,G16>=P6),AND(I16>=P5,I16>=P6),AND(O16>=P5,O16>=P6)),\"Oui\",\"Non\")","v":"Non"}]
[]
[]
[null,null,{"$f":"Candidats!A2&\" \"&Candidats!B2","v":"Bertrand CHEVALIER"},null,{"$f":"Candidats!A3&\" \"&Candidats!B3","v":"Marc ARCHAMBAULT"},null,{"$f":"Candidats!A4&\" \"&Candidats!B4","v":"Étienne BUTZBACH"},null,{"$f":"Candidats!A5&\" \"&Candidats!B5","v":"Bastien FAUDOT"},null,{"$f":"Candidats!A6&\" \"&Candidats!B6","v":"Christophe GRUDLER"},null,{"$f":"Candidats!A7&\" \"&Candidats!B7","v":"Jean-Marie PHEULPIN"},null,{"$f":"Candidats!A8&\" \"&Candidats!B8","v":"Damien MESLOT"}]
[]
[]
["Suffrages Exprimés",null,{"$f":"RESULTATS!U47","v":704},null,{"$f":"RESULTATS!X47","v":1780},null,{"$f":"RESULTATS!AA47","v":3165},null,{"$f":"RESULTATS!AD47","v":1617},null,{"$f":"RESULTATS!AG47","v":2321},null,{"$f":"RESULTATS!AJ47","v":293},null,{"$f":"RESULTATS!AM47","v":4925}]
[]
["% des Suffrages Exprimés",null,{"$f":"IF(RESULTATS!$Q$47=0,0,RESULTATS!U47/RESULTATS!$Q$47)","v":4.755150287065181E-2},null,{"$f":"IF(RESULTATS!$Q$47=0,0,RESULTATS!X47/RESULTATS!$Q$47)","v":0.12022965214454576},null,{"$f":"IF(RESULTATS!$Q$47=0,0,RESULTATS!$AA47/RESULTATS!$Q$47)","v":0.21377912867274571},null,{"$f":"IF(RESULTATS!$Q$47=0,0,RESULTATS!$AD47/RESULTATS!$Q$47)","v":0.10921985815602837},null,{"$f":"IF(RESULTATS!$Q$47=0,0,RESULTATS!AG47/RESULTATS!$Q$47)","v":0.15677136102668018},null,{"$f":"IF(RESULTATS!$Q$47=0,0,RESULTATS!$AJ47/RESULTATS!$Q$47)","v":1.9790611279972982E-2},null,{"$f":"IF(RESULTATS!$Q$47=0,0,RESULTATS!$AM47/RESULTATS!$Q$47)","v":0.33265788584937522}]
[]
["Sièges à répartir",{"$f":"P3","v":30}]
[]
["Suffrages à prendre en compte (2)",null,{"$f":"IF(C16>=$P$8,C16,0)","v":0},null,{"$f":"IF(E16>=$P$8,E16,0)","v":1780},null,{"$f":"IF(G16>=$P$8,G16,0)","v":3165},null,{"$f":"IF(I16>=$P$8,I16,0)","v":1617},null,{"$f":"IF(K16>=$P$8,K16,0)","v":2321},null,{"$f":"IF(M16>=$P$8,M16,0)","v":0},null,{"$f":"IF(O16>=$P$8,O16,0)","v":4925}]
[]
[{"$f":"IF(OR(($C$16>=$P$5),($E$16>=$P$5),($G$16>=$P$5),($I$16>=$P$5),($O$16>=$P$5)),\"\",\"Second tour\")","v":"Second tour"},null,{"$f":"IF(OR(($C$16>=$P$5),($E$16>=$P$5),($G$16>=$P$5),($I$16>=$P$5),($O$16>=$P$5)),\"\",IF(C$16>=$P$7,\"Maintien possible\",IF(C$16>=$P$8,\"Fusion possible\",\"\")))","v":""},null,{"$f":"IF(OR(($C$16>=$P$5),($E$16>=$P$5),($G$16>=$P$5),($I$16>=$P$5),($O$16>=$P$5)),\"\",IF(E$16>=$P$7,\"Maintien possible\",IF(E$16>=$P$8,\"Fusion possible\",\"\")))","v":"Maintien possible"},null,{"$f":"IF(OR(($C$16>=$P$5),($E$16>=$P$5),($G$16>=$P$5),($I$16>=$P$5),($O$16>=$P$5)),\"\",IF(G$16>=$P$7,\"Maintien possible\",IF(G$16>=$P$8,\"Fusion possible\",\"\")))","v":"Maintien possible"},null,{"$f":"IF(OR(($C$16>=$P$5),($E$16>=$P$5),($G$16>=$P$5),($I$16>=$P$5),($O$16>=$P$5)),\"\",IF(I$16>=$P$7,\"Maintien possible\",IF(I$16>=$P$8,\"Fusion possible\",\"\")))","v":"Maintien possible"},null,{"$f":"IF(OR(($C$16>=$P$5),($E$16>=$P$5),($G$16>=$P$5),($I$16>=$P$5),($O$16>=$P$5)),\"\",IF(K$16>=$P$7,\"Maintien possible\",IF(K$16>=$P$8,\"Fusion possible\",\"\")))","v":"Maintien possible"},null,{"$f":"IF(OR(($C$16>=$P$5),($E$16>=$P$5),($G$16>=$P$5),($I$16>=$P$5),($O$16>=$P$5)),\"\",IF(M$16>=$P$7,\"Maintien possible\",IF(M$16>=$P$8,\"Fusion possible\",\"\")))","v":""},null,{"$f":"IF(OR(($C$16>=$P$5),($E$16>=$P$5),($G$16>=$P$5),($I$16>=$P$5),($O$16>=$P$5)),\"\",IF(O$16>=$P$7,\"Maintien possible\",IF(O$16>=$P$8,\"Fusion possible\",\"\")))","v":"Maintien possible"}]
["Sièges attribués au scrutin majoritaire (3)",null,{"$f":"IF(AND(C$16>=P6,C$16>=$P$5),$P$4,0)","v":0},null,{"$f":"IF(AND(E$16>=$P$6,E$16>=$P$5),$P$4,0)","v":0},null,{"$f":"IF(AND(G$16>=$P$6,G$16>=$P$5),$P$4,0)","v":0},null,{"$f":"IF(AND(I$16>=$P$6,I$16>=$P$5),$P$4,0)","v":0},null,{"$f":"IF(AND(K$16>=$P$6,K$16>=$P$5),$P$4,0)","v":0},null,{"$f":"IF(AND(M$16>=$P$6,M$16>=$P$5),$P$4,0)","v":0},null,{"$f":"IF(AND(O$16>=$P$6,O$16>=$P$5),$P$4,0)","v":0}]
[]
["Sièges restants",{"$f":"$B$20-SUM($C$25:$O$25)","v":30}]
[]
["Sièges attribués à la proportionnelle (4)",null,{"$f":"IF(OR(SUM($C$25:$O$25)=0,$P$9=0,C22=0),0,INT(C16/$P$9))","v":0},null,{"$f":"IF(OR(SUM($C$25:$O$25)=0,$P$9=0,E22=0),0,INT(E16/$P$9))","v":0},null,{"$f":"IF(OR(SUM($C$25:$O$25)=0,$P$9=0,G22=0),0,INT(G16/$P$9))","v":0},null,{"$f":"IF(OR(SUM($C$25:$O$25)=0,$P$9=0,I22=0),0,INT(I16/$P$9))","v":0},null,{"$f":"IF(OR(SUM($C$25:$O$25)=0,$P$9=0,K22=0),0,INT(K16/$P$9))","v":0},null,{"$f":"IF(OR(SUM($C$25:$O$25)=0,$P$9=0,M22=0),0,INT(M16/$P$9))","v":0},null,{"$f":"IF(OR(SUM($C$25:$O$25)=0,$P$9=0,O22=0),0,INT(O16/$P$9))","v":0}]
[]
["Sièges restants",{"$f":"$B$27-SUM($C$29:$O$29)","v":30}]
[]
["1ère moyenne des listes",null,{"$f":"IF(AND($B$31>=1,$B$31<>$B$27,C22<>0),C16/(C29+1),0)","v":0},null,{"$f":"IF(AND($B$31>=1,$B$31<>$B$27,E22<>0),E16/(E29+1),0)","v":0},null,{"$f":"IF(AND($B$31>=1,$B$31<>$B$27,G22<>0),G16/(G29+1),0)","v":0},null,{"$f":"IF(AND($B$31>=1,$B$31<>$B$27,I22<>0),I16/(I29+1),0)","v":0},null,{"$f":"IF(AND($B$31>=1,$B$31<>$B$27,K22<>0),K16/(K29+1),0)","v":0},null,{"$f":"IF(AND($B$31>=1,$B$31<>$B$27,M22<>0),M16/(M29+1),0)","v":0},null,{"$f":"IF(AND($B$31>=1,$B$31<>$B$27,O22<>0),O16/(O29+1),0)","v":0}]
[]
["Sièges attribués à la 1ère plus forte moyenne",null,{"$f":"IF(AND(MAX($C33:$O33)=C33,$B$31<>0,$B$31<>$B$27),1,0)","v":0},null,{"$f":"IF(AND(MAX($C33:$O33)=E33,$B$31<>0,$B$31<>$B$27),1,0)","v":0},null,{"$f":"IF(AND(MAX($C33:$O33)=G33,$B$31<>0,$B$31<>$B$27),1,0)","v":0},null,{"$f":"IF(AND(MAX($C33:$O33)=I33,$B$31<>0,$B$31<>$B$27),1,0)","v":0},null,{"$f":"IF(AND(MAX($C33:$O33)=K33,$B$31<>0,$B$31<>$B$27),1,0)","v":0},null,{"$f":"IF(AND(MAX($C33:$O33)=M33,$B$31<>0,$B$31<>$B$27),1,0)","v":0},null,{"$f":"IF(AND(MAX($C33:$O33)=O33,$B$31<>0,$B$31<>$B$27),1,0)","v":0}]
[]
["Sièges restants",{"$f":"$B$31-SUM($C$35:$O$35)","v":30}]
[]
["2ème moyenne des listes",null,{"$f":"IF(AND($B$37>=1,$B$37<>$B$31,C22<>0),C16/(C29+C35+1),0)","v":0},null,{"$f":"IF(AND($B$37>=1,$B$37<>$B$31,E22<>0),E16/(E29+E35+1),0)","v":0},null,{"$f":"IF(AND($B$37>=1,$B$37<>$B$31,G22<>0),G16/(G29+G35+1),0)","v":0},null,{"$f":"IF(AND($B$37>=1,$B$37<>$B$31,I22<>0),I16/(I29+I35+1),0)","v":0},null,{"$f":"IF(AND($B$37>=1,$B$37<>$B$31,K22<>0),K16/(K29+K35+1),0)","v":0},null,{"$f":"IF(AND($B$37>=1,$B$37<>$B$31,M22<>0),M16/(M29+M35+1),0)","v":0},null,{"$f":"IF(AND($B$37>=1,$B$37<>$B$31,O22<>0),O16/(O29+O35+1),0)","v":0}]
[]
["Sièges attribués à la 2ème plus forte moyenne",null,{"$f":"IF(AND(MAX($C39:$O39)=C39,$B$37<>0,$B$37<>$B$31),1,0)","v":0},null,{"$f":"IF(AND(MAX($C39:$O39)=E39,$B$37<>0,$B$37<>$B$31),1,0)","v":0},null,{"$f":"IF(AND(MAX($C39:$O39)=G39,$B$37<>0,$B$37<>$B$31),1,0)","v":0},null,{"$f":"IF(AND(MAX($C39:$O39)=I39,$B$37<>0,$B$37<>$B$31),1,0)","v":0},null,{"$f":"IF(AND(MAX($C39:$O39)=K39,$B$37<>0,$B$37<>$B$31),1,0)","v":0},null,{"$f":"IF(AND(MAX($C39:$O39)=M39,$B$37<>0,$B$37<>$B$31),1,0)","v":0},null,{"$f":"IF(AND(MAX($C39:$O39)=O39,$B$37<>0,$B$37<>$B$31),1,0)","v":0}]
[]
["Sièges restants",{"$f":"$B$37-SUM($C$41:$O$41)","v":30}]
[]
["3ème moyenne des listes",null,{"$f":"IF(AND($B$43>=1,$B$43<>$B$37,C22<>0),C16/(C29+C35+C41+1),0)","v":0},null,{"$f":"IF(AND($B$43>=1,$B$43<>$B$37,E22<>0),E16/(E29+E35+E41+1),0)","v":0},null,{"$f":"IF(AND($B$43>=1,$B$43<>$B$37,G22<>0),G16/(G29+G35+G41+1),0)","v":0},null,{"$f":"IF(AND($B$43>=1,$B$43<>$B$37,I22<>0),I16/(I29+I35+I41+1),0)","v":0},null,{"$f":"IF(AND($B$43>=1,$B$43<>$B$37,K22<>0),K16/(K29+K35+K41+1),0)","v":0},null,{"$f":"IF(AND($B$43>=1,$B$43<>$B$37,M22<>0),M16/(M29+M35+M41+1),0)","v":0},null,{"$f":"IF(AND($B$43>=1,$B$43<>$B$37,O22<>0),O16/(O29+O35+O41+1),0)","v":0}]
[]
["Sièges attribués à la 3ème plus forte moyenne",null,{"$f":"IF(AND(MAX($C45:$O45)=C45,$B$43<>0,$B$43<>$B$37),1,0)","v":0},null,{"$f":"IF(AND(MAX($C45:$O45)=E45,$B$43<>0,$B$43<>$B$37),1,0)","v":0},null,{"$f":"IF(AND(MAX($C45:$O45)=G45,$B$43<>0,$B$43<>$B$37),1,0)","v":0},null,{"$f":"IF(AND(MAX($C45:$O45)=I45,$B$43<>0,$B$43<>$B$37),1,0)","v":0},null,{"$f":"IF(AND(MAX($C45:$O45)=K45,$B$43<>0,$B$43<>$B$37),1,0)","v":0},null,{"$f":"IF(AND(MAX($C45:$O45)=M45,$B$43<>0,$B$43<>$B$37),1,0)","v":0},null,{"$f":"IF(AND(MAX($C45:$O45)=O45,$B$43<>0,$B$43<>$B$37),1,0)","v":0}]
[]
["Sièges restants",{"$f":"$B$43-SUM($C$47:$O$47)","v":30}]
[]
[]
["TOTAL DES SIÈGES RÉPARTIS",null,{"$f":"SUM(C25+C29+C35+C41+C47)","v":0},null,{"$f":"SUM(E25+E29+E35+E41+E47)","v":0},null,{"$f":"SUM(G25+G29+G35+G41+G47)","v":0},null,{"$f":"SUM(I25+I29+I35+I41+I47)","v":0},null,{"$f":"SUM(K25+K29+K35+K41+K47)","v":0},null,{"$f":"SUM(M25+M29+M35+M41+M47)","v":0},null,{"$f":"SUM(O25+O29+O35+O41+O47)","v":0}]
[]
[null,null,"(1) Somme des Suffrages Exprimés des listes >= 5% du total des Exprimés / le nombre de sièges restant après répartition au scrutin majoritaire"]
[null,null,"(2) Listes ayant obtenues au mois 5% du total des Exprimés"]
[null,null,"(3) Affectation de la Majorité absolue des sièges (23) à la liste qui a obtenu au moins la majorité absolue des Exprimés"]
[null,null,"(4) Suffrages Exprimés de la liste / Quotient Electoral"]

{"sheet":"ELUS 1T","index":37,"n_rows":49,"n_cols":28,"rows_kept":49,"cut":false,"hidden":false,"merged":[]}
[null,null,null,null,null,null,null,null,null,"            DÉSIGNATION  des  ÉLUS   au   1er   TOUR"]
[null,null,"VdB","CAB",null,null,"VdB","CAB",null,null,"VdB","CAB",null,null,"VdB","CAB",null,null,"VdB","CAB",null,null,"VdB","CAB",null,null,"VdB","CAB"]
[null,{"$f":"CONCATENATE(Candidats!$A2,\" \",Candidats!$B2)","v":"Bertrand CHEVALIER"},{"$f":"SUM('REPART VdB 1T'!C52)","v":0},{"$f":"SUM('REPART CAB 1T'!C52)","v":0},null,{"$f":"CONCATENATE(Candidats!$A3,\" \",Candidats!$B3)","v":"Marc ARCHAMBAULT"},{"$f":"SUM('REPART VdB 1T'!E52)","v":0},{"$f":"SUM('REPART CAB 1T'!E52)","v":0},null,{"$f":"CONCATENATE(Candidats!$A4,\" \",Candidats!$B4)","v":"Étienne BUTZBACH"},{"$f":"SUM('REPART VdB 1T'!G52)","v":0},{"$f":"SUM('REPART CAB 1T'!G52)","v":0},null,{"$f":"CONCATENATE(Candidats!$A5,\" \",Candidats!$B5)","v":"Bastien FAUDOT"},{"$f":"SUM('REPART VdB 1T'!I52)","v":0},{"$f":"SUM('REPART CAB 1T'!I52)","v":0},null,{"$f":"CONCATENATE(Candidats!$A6,\" \",Candidats!$B6)","v":"Christophe GRUDLER"},{"$f":"SUM('REPART VdB 1T'!K52)","v":0},{"$f":"SUM('REPART CAB 1T'!K52)","v":0},null,{"$f":"CONCATENATE(Candidats!$A7,\" \",Candidats!$B7)","v":"Jean-Marie PHEULPIN"},{"$f":"SUM('REPART VdB 1T'!M52)","v":0},{"$f":"SUM('REPART CAB 1T'!M52)","v":0},null,{"$f":"CONCATENATE(Candidats!$A8,\" \",Candidats!$B8)","v":"Damien MESLOT"},{"$f":"SUM('REPART VdB 1T'!O52)","v":0},{"$f":"SUM('REPART CAB 1T'!O52)","v":0}]
[]
[1,"Bertrand CHEVALIER",{"$f":"IF((C$3>=$A5),\"ÉLU\",\"\")","v":""},{"$f":"IF((D$3>=$A5),\"ÉLU\",\"\")","v":""},1,"Marc ARCHAMBAULT",{"$f":"IF((G$3>=$A5),\"ÉLU\",\"\")","v":""},"",1,"Etienne BUTZBACH",{"$f":"IF((K$3>=$A5),\"ÉLU\",\"\")","v":""},"",1,"Bastien FAUDOT",{"$f":"IF((O$3>=$A5),\"ÉLU\",\"\")","v":""},"",1,"Christophe GRUDLER",{"$f":"IF((S$3>=$A5),\"ÉLU\",\"\")","v":""},"",1,"Jean-Marie PHEULPIN",{"$f":"IF((W$3>=$A5),\"ÉLU\",\"\")","v":""},"",1,"Damien MESLOT",{"$f":"IF((AA$3>=$A5),\"ÉLU\",\"\")","v":""},""]
[2,"Muriel TERNANT",{"$f":"IF((C$3>=$A6),\"ÉLU\",\"\")","v":""},"",2,"Marie-Eloïse NARDINI","","",2,"Samia JABER","","",2,"Isabelle LOPEZ","","",2,"Béatrice CUENIN","","",2,"Estelle ROUSSEAUX","","",2,"Florence BESANCENOT","",""]
[3,"Damien PAGNONCELLI","","",3,"Thibaut MONNIER","","",3,"Gérard SIMON","","",3,"Bruno KERN","","",3,"Dominique PERRIN","","",3,"Daniel ROUILLON","","",3,"Sébastien VIVOT","",""]
[4,"Jocelyne GRASSELER","","",4,"Patricia BOISUMEAU","","",4,"Eva PEDROCCHI","","",4,"Gwénaëlle RADAIS","","",4,"Julie DE BREZA","","",4,"Christiane PETITOT","","",4,"Marie-Hélène IVOL","",""]
[5,"Jacques MEISTER","","",5,"Eric WIEDMANN","","",5,"Robert BELOT","","",5,"Alain LETAILLEUR","","",5,"Jean-Claude GIROUD","","",5,"Jean LHEUREUX","","",5,"Mustapha LOUNES","",""]
[6,"Stéphanie EVRARD","","",6,"Marie-Jose LEHMANN","","",6,"Jacqueline GUIOT","","",6,"Nagia MEGHRICHE","","",6,"Touria ACAR","","",6,"Éliane LACAILLE","","",6,"Delphine MENTRE","",""]
[7,"Aurélien ARAMINI","","",7,"Claude FRANÇOIS","","",7,"Mazouz BENLAZERI","","",7,"Olivier PREVOT","","",7,"Jean-Christophe MESSIN","","",7,"Jean-Luc DESHAYES","","",7,"Ian BOUCARD","",""]
[8,"Josette COUQUEBERG","","",8,"Olivia SCHNOEBELEN","","",8,"Armelle LELEUP","","",8,"Nadine DANTON-SCHALK","","",8,"Laetitia GUILBERT","","",8,"Nadine BOUDINET","","",8,"Marie ROCHETTE DE LEMPDES","",""]
[9,"Michel BARDOT","","",9,"Franck FOURE","","",9,"René SCHMITT","","",9,"Lakhdar CHERFAOUI","","",9,"Renaud ROUSSELET","","",9,"Patrice BOUILLON","","",9,"Jean-Marie HERZOG","",""]
[10,"Dominique BOURGON","","",10,"Céline MAIROT","","",10,"Francine GALLIEN","","",10,"Géraldine SIMON","","",10,"Nicole VALENTIN","","",10,"Sylvie MARTIN","","",10,"Monique MONNOT","",""]
[11,"Jacques LALANDE","","",11,"Hervé BRUNET","","",11,"Alain DREYFUS-SCHMIDT","","",11,"Jean-Michel GLON-VILLENEUVE","","",11,"Joseph ILLANA","","",11,"Guy CAMOZZI","","",11,"Jean-Pierre MARCHAND","",""]
[12,"Brigitte FRICKERT","","",12,"Ginette PETITPERRIN","","",12,"Latifa GILLIOTTE","","",12,"Véronique SOHIER","","",12,"Khadija EL MACHMOUR","","",12,"Véronique ZUCCHELI","","",12,"Marion VALLET","",""]
[13,"Raynald PEDROSA","","",13,"René CARDOT","","",13,"Selim GUEMAZI","","",13,"Philippe PEQUIGNOT","","",13,"Jean-Michel COLLINO","","",13,"Abderrazak HADDADOU","","",13,"Gérard PIQUEPAILLE","",""]
[14,"Marie-Claude BEURET","","",14,"Chloé BABELOT","","",14,"Céline SOUAKRIA","","",14,"Noura BOUGUERRA","","",14,"Dominique MAZZUCCHELLI","","",14,"Corinne LAHSSEN","","",14,"Frieda BACHARETTI","",""]
[15,"Jean RAUSHER","","",15,"Jean RECEVEUR","","",15,"Hubert BELZ","","",15,"Maurice SCHWARTZ","","",15,"Ouahem BOUDJADJA","","",15,"Anthony ROPELE","","",15,"Alain PICARD","",""]
[16,"Assika JARDIN","","",16,"Leslie BROCARD","","",16,"Marie-Christine MOREL","","",16,"Marie-Laure SCHNEIDER","","",16,"Sylvie FRANCOIS","","",16,"Christiane ROUPLY","","",16,"Marie STABILE","",""]
[17,"Martial PEUGEOT","","",17,"Dominique FREUND","","",17,"Pascal MARTIN","","",17,"Dominique MEA","","",17,"Aziz DAOUDI","","",17,"Pierre CAILLE","","",17,"Pierre-Jérôme COLLARD","",""]
[18,"Sylvie BERNARD","","",18,"Cindy BURGKHALTER","","",18,"Nicole LARCAT","","",18,"Aurélie JEANGERARD","","",18,"Frédérique HENNEQUIN","","",18,"Françoise DOUTEY","","",18,"Parvin CERF","",""]
[19,"Jacques DATO-BRACONNIER","","",19,"Roger GUILLAUME","","",19,"Azeddine GOUTAS","","",19,"Abdel Jalil ABBAS-TURKI","","",19,"Pierre-Olivier FAVRE","","",19,"Christian MATHIE","","",19,"Yves VOLA","",""]
[20,"Edith JOUQUEZ","","",20,"Alexandra GROSS","","",20,"Marie-Antoinette VACELET","","",20,"Charline COUTHERUT","","",20,"Céline RINGENBACH","","",20,"Kheira DAOUD","","",20,"Loubna CHEKOUAT","",""]
[21,"Isidore N'DOLIAM","","",21,"Gaëtan DEVILLERS",{"$f":"IF((G$3>=$A25),\"ÉLU\",\"\")","v":""},"",21,"Bertrand THIEBAUD",{"$f":"IF((K$3>=$A25),\"ÉLU\",\"\")","v":""},"",21,"Vladimir DJORDJEVIC",{"$f":"IF((O$3>=$A25),\"ÉLU\",\"\")","v":""},"",21,"Alban CHATIN",{"$f":"IF((S$3>=$A25),\"ÉLU\",\"\")","v":""},"",21,"Arnaud CLETY",{"$f":"IF((W$3>=$A25),\"ÉLU\",\"\")","v":""},"",21,"Tony KNEIP",{"$f":"IF((AA$3>=$A25),\"ÉLU\",\"\")","v":""},""]
[22,"Françoise BOUILLON","","",22,"Denise MICHALLAND","","",22,"Corinne BOHLINGER","","",22,"Josée MARTINEZ","","",22,"Martine FRANCOIS","","",22,"Nathalie NIDDEGER","","",22,"Claude JOLY","",""]
[23,"Jean PARENTY","","",23,"Maurice FERNEL","","",23,"Abdelghani NIAME","","",23,"Christian PROUST","","",23,"Christian VUILLIER DEVILLERS","","",23,"Christian DANNECKER","","",23,"Brice MICHEL","",""]
[24,"Maeva DURAND","","",24,"Marie-Antoinette DECLE","","",24,"Martine DAERON","","",24,"Monique NANINO","","",24,"Cindy GIRARD","","",24,"Lætitia MARCHANDOT","","",24,"Marie-Thérèse FOHRER","",""]
[25,"Lucien MERGER","","",25,"Germain THONNESSEN","","",25,"Joël BIGNAMI","","",25,"Yacine HOUADEF","","",25,"Patrick FERRAIN","","",25,"Arnaud VERMELLE","","",25,"François BORON","",""]
[26,"Arlette CLERC","","",26,"Sophie CANET","","",26,"Anny MOREL-GRUNBLATT","","",26,"Madeleine FLEURY","","",26,"Rachida KIAS","","",26,"Dominique LEGER","","",26,"Pascale CHAGUE","",""]
[27,"Daniel BARDOT","","",27,"Manuel CHANTERANNE","","",27,"Salih AKTAS","","",27,"Jean-Paul BOURREAU","","",27,"Alain GRADELER","","",27,"Dominique GIMENO","","",27,"Guy CORVEC","",""]
[28,"Sandra JOLY","","",28,"Chantal TOURDOT","","",28,"Marie-José JOURD'HEUIL","","",28,"Eva GUYOT","","",28,"Jennifer LEDUC","","",28,"Alexandra GIULIANI","","",28,"Léa MANGUIN","",""]
[29,"Robert RETG","","",29,"Cyril BURGKHALTER","","",29,"Francis COTTET","","",29,"Guillaume ASTIER","","",29,"Eric CARON","","",29,"François MAIGNE","","",29,"David DIMEY","",""]
[30,"Juliette HAMARD","","",30,"Marie DENIZET","","",30,"Christine POWOLNY","","",30,"Fabienne DERRIEN","","",30,"Marie-Hélène GRANDJEAN","","",30,"Geneviève RIVIERE","","",30,"Christiane EINHORN","",""]
[31,"Benoit JOUQUEZ","","",31,"Mathieu KAMINSKI","","",31,"Philippe VENCK","","",31,"Denis GREVILLOT","","",31,"Nicolas VIGNOS","","",31,"Bruno BLIND","","",31,"Olivier DEROY","",""]
[32,"Germaine TRIBOT","","",32,"Florence OUDRY","","",32,"Lorène BAUDET","","",32,"Zoé RUNDSTADLER","","",32,"Véronique MANGE","","",32,"Senoussia HADJICI","","",32,"Brigitte BRUN","",""]
[33,"Michel GIRARD","","",33,"Philippe WITTLING","","",33,"Dominique SIESS","","",33,"Guy DESGRANGES","","",33,"Michel RENAUD","","",33,"Joël WERMEILLE","","",33,"Emmanuel FILLAUDEAU","",""]
[34,"Laurence JACQUIN","","",34,"Juliette BRULLOT","","",34,"Evelyne GIULIANI","","",34,"Cécilia PAUVRET","","",34,"Nathalie DUFFNER","","",34,"Rhaphaele ROBBIANO","","",34,"Isabelle HELIOT","",""]
[35,"Gérard HEIBERGER","","",35,"Eric NICOLAS","","",35,"Pascal BROGGI","","",35,"Jérémy GRESSOT","","",35,"Cherif ALKMA","","",35,"Philippe CUZIN","","",35,"Patrick FORESTIER","",""]
[36,"Chantal PERRON","","",36,"Sabrina LE-FEVRE","","",36,"Rahima HOUADEF","","",36,"Noëmie HENNEQUIN","","",36,"Patricia TOURDOT","","",36,"Sibylle IELSCH","","",36,"Dominique CHIPEAUX","",""]
[37,"Jacques GRASSELER","","",37,"François RITZMANN","","",37,"Claude PAUFERT","","",37,"Dominique FUMEY","","",37,"Alexandre GRIEDER","","",37,"Matthieu HENRY","","",37,"Ugur UCAL","",""]
[38,"Jacqueline GIRARDOT","","",38,"Lucette LAMBERT","","",38,"Chantal GAMMA","","",38,"Alexandra KRSTIC","","",38,"Alicia PACIOS","","",38,"Christiane VOISINET","","",38,"Michelle BECUE","",""]
[39,"Claude ROMMEVAUX","","",39,"Nicolas OBRY","","",39,"Philippe LEGROS","","",39,"André DA COL","","",39,"David BARDOT","","",39,"Mokdad KHADRAOUI","","",39,"Gérard THOUVEREZ","",""]
[40,"Michèle CHEVROLET","","",40,"Andrée LAMIELLE","","",40,"Hermine LIBAI","","",40,"Christelle BOISSON","","",40,"Gisèle TEKLER","","",40,"Bernadette BARLOY","","",40,"Cécile DAVID","",""]
[41,"Frédéric ESCAFFIT","","",41,"Denis FURDERER","","",41,"Nicolas FRIOT","","",41,"Jean-Michel PERCHE","","",41,"Geoffroy KUHN","","",41,"David CAMPY","","",41,"Alain COULOT","",""]
[42,"Angélique LUDWIG","","",42,"Germaine MEYER","","",42,"Linda BOUSSAHA","","",42,"Renée REMY","","",42,"Alison PFIFFER","","",42,"Charlotte GINDRE","","",42,"Karine BOSSU","",""]
[43,"René LEBOEUF","","",43,"Denis LE-FEVRE","","",43,"Mohamed BOULGUID","","",43,"Paul COLLIN","","",43,"Jean-Pierre THURNHERR","","",43,"Albert IELSCH","","",43,"Alain AIMMEUR","",""]
[44,"Paulette DRZEWIECKI","","",44,"Louisette BRULLOT","","",44,"Myriam LATOUR","","",44,"Dominique ROGNON","","",44,"Iabelle BRUGNONI","","",44,"Claudine LHEUREUX","","",44,"Jocelyne JECKER","",""]
[45,"Joël NIESS","","",45,"René THIRIET","","",45,"Arthur COURTY","","",45,"Édouard BONTEMPS","","",45,"François ZIEGLER","","",45,"Philippe CORDONNIER","","",45,"Christian BEAUSEIGNEUR","",""]

{"sheet":"Candidats","index":38,"n_rows":8,"n_cols":5,"rows_kept":8,"cut":false,"hidden":false,"merged":[]}
["Prénom","Nom","Parti","Photo","Commentaire"]
["Bertrand","CHEVALIER","Pour Belfort, l'humain d'abord","bchevalier",{"$f":"IF(RESULTATS!$X$2=28,'REPART VdB 1T'!C$24,\"\")","v":""}]
["Marc","ARCHAMBAULT","Belfort Bleu marine","marchambault",{"$f":"IF(RESULTATS!$X$2=28,'REPART VdB 1T'!E$24,\"\")","v":"Maintien possible"}]
["Étienne","BUTZBACH","Belfort, Innovante et bienveillante","ebutzbach",{"$f":"IF(RESULTATS!$X$2=28,'REPART VdB 1T'!G$24,\"\")","v":"Maintien possible"}]
["Bastien","FAUDOT","Oser Belfort","bfaudot",{"$f":"IF(RESULTATS!$X$2=28,'REPART VdB 1T'!I$24,\"\")","v":"Maintien possible"}]
["Christophe","GRUDLER","Un nouveau souffle pour Belfort","cgrudler",{"$f":"IF(RESULTATS!$X$2=28,'REPART VdB 1T'!K$24,\"\")","v":"Maintien possible"}]
["Jean-Marie","PHEULPIN","Lutte Ouvrière Faire entendre le camp des Travailleurs","jmpheulpin",{"$f":"IF(RESULTATS!$X$2=28,'REPART VdB 1T'!M$24,\"\")","v":""}]
["Damien","MESLOT","Tous ensemble pour Belfort","dmeslot",{"$f":"IF(RESULTATS!$X$2=28,'REPART VdB 1T'!O$24,\"\")","v":"Maintien possible"}]

{"sheet":"GRAPHE","index":39,"n_rows":4,"n_cols":11,"rows_kept":4,"cut":false,"hidden":false,"merged":[[0,10,0,11],[0,2,0,9]]}
["Mairie de Belfort",null,"ÉLECTIONS MUNICIPALES",null,null,null,null,null,null,null,"2014-03-23"]
[]
[null,null,{"$f":"COUNTIF(RESULTATS!$I$12:$I$18,\">0\")+COUNTIF(RESULTATS!$I$20:$I$25,\">0\")+COUNTIF(RESULTATS!$I$27:$I$31,\">0\")+COUNTIF(RESULTATS!$I$33:$I$38,\">0\")+COUNTIF(RESULTATS!$I$40:$I$43,\">0\")","v":28}," Bureaux sur",null,{"$f":"COUNTIF(RESULTATS!$E$12:$E$18,\">0\")+COUNTIF(RESULTATS!$E$20:$E$25,\">0\")+COUNTIF(RESULTATS!$E$27:$E$31,\">0\")+COUNTIF(RESULTATS!$E$33:$E$38,\">0\")+COUNTIF(RESULTATS!$E$40:$E$43,\">0\")","v":28}]
[null,null,{"$f":"SUMIF(RESULTATS!$I$12:$I$18,\">0\",RESULTATS!$E$12:$E$18)+SUMIF(RESULTATS!$I$20:$I$25,\">0\",RESULTATS!$E$20:$E$25)+SUMIF(RESULTATS!$I$27:$I$31,\">0\",RESULTATS!$E$27:$E$31)+SUMIF(RESULTATS!$I$33:$I$38,\">0\",RESULTATS!$E$33:$E$38)+SUMIF(RESULTATS!$I$40:$I$43,\">0\",RESULTATS!$E$40:$E$43)","v":26948},"Inscrits sur",null,{"$f":"RESULTATS!E47","v":26948},"soit",":",{"$f":"C4/F4","v":1}]